{"text_format":"3","workbook":"xlsx","n_sheets":22,"sheets":["Hinweise","Deckblatt","Sachausgaben","Abschreibungen","BM I (1)","BM I (2)","BM I (3)","BM I (4)","BM I (5)","BM I (6)","BM I (7)","BM I (8)","BM II (1)","BM II (2)","BM II (3)","BM II (4)","EPM (1)","EPM (2)","EPM (3)","Personalausgaben","Angaben zur Fachkraft","Ausgaben_ Finanzierung_ges"],"not_rendered":{"defined_names":21,"comments":19},"read":"whole","date_system":"1900"}

{"sheet":"Hinweise","index":0,"n_rows":2,"n_cols":8,"rows_kept":2,"merged":[[1,0,1,7],[2,0,2,7],[3,0,3,7],[4,0,4,7],[8,0,8,7],[9,0,9,7],[10,0,10,7],[11,0,11,7],[13,0,13,7],[14,0,14,7],[15,0,15,7],[16,0,16,7],[17,0,17,7],[18,0,18,7],[19,0,19,7],[20,0,20,7],[21,0,21,7],[22,0,22,7],[23,0,23,7],[24,0,24,7],[25,0,25,7],[26,0,26,7],[27,0,27,7],[28,0,28,7],[29,0,29,7]]}
["Landeshauptstadt Dresden - Jugendamt",{"$nulls":3},"Förderung von Trägern der freien Jugendhilfe",null,null,"Verwendungsnachweis 2019/2020"]
["Hinweise zum Verwendungsnachweis"]

{"sheet":"Deckblatt","index":1,"n_rows":47,"n_cols":19,"rows_kept":47,"merged":[[2,10,2,17],[3,0,3,8],[3,10,3,17],[4,0,5,8],[4,10,4,17],[5,10,7,17],[6,0,6,8],[7,0,7,8],[10,10,13,12],[10,13,13,17],[17,0,17,17],[18,0,18,17],[20,0,21,17],[23,8,23,14],[23,15,23,17],[27,3,27,6],[27,7,27,10],[29,3,29,6],[29,7,29,10],[31,3,31,6],[31,7,31,10],[33,3,33,6],[33,7,33,10],[38,0,38,5],[38,7,38,11],[38,13,38,17],[40,0,40,16],[41,0,41,16],[45,1,45,4],[45,12,45,17]]}
["Landeshauptstadt Dresden - Jugendamt",{"$nulls":16},"Verwendungsnachweis 2019/2020"]
[]
["Zuwendungsempfänger",{"$nulls":9},"Aktenzeichen:"]
[]
[{"$nulls":10},"Angebotsbezeichnung:"]
[]
[]
[]
[]
[{"$nulls":10},"Abgabefrist"]
["Antrags- und Bewilligungshörde:                                                                                                                                                                                                                                                                                    ",{"$nulls":9},"31. März\ndes darauf folgenden Jahres",null,null,"Belegaufstellung, Sachbericht, Teilnahmelisten sind mit einzureichen!"]
["Landeshauptstadt Dresden"]
["Jugendamt, Abt. Kinder-, Jugend- und"]
["Familienförderung, SG Zuschusswesen"]
["Postfach 12 00 20"]
["01001 Dresden "]
[]
["Verwendungsnachweis Einrichtungen und Dienste"]
[" - Zahlenmäßiger Nachweis bei Festbetragsfinanzierung -"]
[]
["Hinweis für Nutzer des Excel-Formulars: Die fett gerahmten Felder weisen darauf hin, dass sie auszufüllen sind, andere Felder enthalten Zellenverknüpfungen oder Formeln. Gilt nicht für Nutzer der PDF-Datei (Handausfüller)!"]
[]
[]
["Bewilligungs-/Abrechnungszeitraum:"]
[{"$nulls":8},"Tag/Monat/von/bis (z. B. 01.01. bis 31.12.)",{"$nulls":6},"Jahr"]
["Abrechnung der Zuwendung:"]
[]
[{"$nulls":3},"Zuwendung Jugendamt (gemäß Bescheid)",{"$nulls":7},"EUR"]
[]
[{"$nulls":3},"ausgezahlte Zuwendung",{"$nulls":7},"EUR"]
[]
[{"$nulls":3},"Abrechnung Zuwendung Jugendamt",{"$nulls":3},{"$f":"'Ausgaben_ Finanzierung_ges'!M10","v":0},{"$nulls":3},"EUR",{"$nulls":6}," -> Wertübernahme aus dem Ausgaben- und Finanzierungsplan -  erst die Folgeblätter ausfüllen!"]
[]
[{"$nulls":3},"Erstattungsbetrag",{"$nulls":3},{"$f":"IF(H30=0,H28-H32,(IF(H32<H30,H30-H32,0)))","v":0},{"$nulls":3},"EUR",{"$nulls":6}," -> selbstrechnendes Feld - das richtige Ergebnis erscheint erst, nachdem Formular vollständig ausgefüllt wurde"]
[]
[]
["Bearbeiter/-in/Ansprechperson:"]
["Name",{"$nulls":6},"Tel.-/Fax-Nr.",{"$nulls":5},"Email-Adresse"]
[]
["Bestätigung des Zuwendungsempfängers:"]
["Es wird bestätigt, dass die Angaben im Verwendungsnachweis sachlich und rechnerisch richtig sind, die Ausgaben notwendig waren, wirtschaftlich und sparsam verfahren worden ist sowie die Angaben mit den Büchern und Belegen übereinstimmen und die Echtheit der Herkunft und Unversehrtheit des Inhaltes der Belege gewährleistet ist."]
["Es wird bestätigt, dass - sofern zutreffend (siehe Zuwendungsbescheid) -bei der Durchführung des Angebotes die qualitativen und quantitativen Leistungsstandards des Landesjugendamtes, soweit sie in Orientierungshilfen und Empfehlungen veröffentlicht wurden, eingehalten wurden."]
["Es liegt eine Vorsteuerabzugsberechtigung vor: ",{"$nulls":8},"Ja",null,"Nein",null,"(Zutreffendes ankreuzen)"]
["(Die Ausgaben sind - sofern eine  Vorsteuerabzugsberechtigung vorliegt - ohne Umsatzsteuer auszuweisen.)"]
[]
[]
[null,"Ort, Datum",{"$nulls":4},"rechtsverbindliche Unterschrift(en)",{"$nulls":5},"in Block-/PC-Schrift"]

{"sheet":"Sachausgaben","index":2,"n_rows":38,"n_cols":14,"rows_kept":38,"merged":[[0,13,0,15],[1,10,1,11],[2,0,2,12],[2,13,2,15],[3,0,16,0],[3,2,4,3],[3,11,3,12],[3,13,3,15],[4,13,4,15],[5,13,5,15],[6,11,6,12],[6,13,6,15],[7,11,7,12],[7,13,7,15],[8,11,8,12],[8,13,8,15],[9,2,9,12],[9,13,9,15],[10,2,10,12],[10,13,10,15],[11,2,11,12],[11,13,11,15],[12,2,12,12],[12,13,12,15],[13,2,13,12],[13,13,13,15],[14,13,14,15],[15,13,15,15],[16,13,16,15],[17,0,23,0],[17,2,17,12],[17,13,17,15],[18,2,18,12],[18,13,18,15],[19,2,19,12],[19,13,19,15],[20,2,20,12],[20,13,20,15],[21,2,21,12],[21,13,21,15],[22,2,22,12],[22,13,22,15],[23,13,23,15],[24,0,32,0],[24,13,24,15],[25,13,25,15],[26,2,26,12],[26,13,26,15],[27,2,27,12],[27,13,27,15],[28,2,28,12],[28,13,28,15],[29,2,29,12],[29,13,29,15],[30,2,30,12],[30,13,30,15],[31,2,31,12],[31,13,31,15],[32,13,32,15],[33,0,34,0],[33,2,33,12],[33,13,33,15],[34,2,34,12],[34,13,34,15],[35,0,36,0],[35,13,35,15],[36,2,36,12],[36,13,36,15],[37,13,37,15]]}
["Landeshauptstadt Dresden - Jugendamt",{"$nulls":7},{"$f":"Deckblatt!R1","v":"Verwendungsnachweis 2019/2020"},{"$nulls":3},"AZ:",{"$f":"Deckblatt!K4","v":0}]
[{"$nulls":5},"Sachausgaben",{"$nulls":4},{"$f":"Deckblatt!P24","v":0}]
["Ausgaben",{"$nulls":12},"EUR"]
["1. Gebäude-/Bewirtschaftungsausgaben","1.1","Miete\n(nur f. Flächen, die vom Angebot genutzt werden)",null,"Kaltmiete",{"$nulls":5},"vom Angebot genutzte Fläche in m²"]
[{"$nulls":4},"Betriebskosten "]
[null,"1.2","weitere Betriebskosten einschl. Medien"]
[null,"1.3","Gebäudepacht/Erbbauzins",{"$nulls":7},"vom Angebot genutzte Fläche in m²"]
[null,"1.4.1","Nutzungsentgelt für fremde Räume",{"$nulls":7},"Anzahl der Nutzungsstunden ges."]
[null,"1.4.2","Nutzungsentgelt für eigene Räume ",{"$nulls":7},"Anzahl der Nutzungsstunden ges."]
[null,"1.5","Reinigungskosten/Hausverbrauchsmaterial/Müllentsorgung"]
[null,"1.6","Erhaltungsaufwand/Reparaturkosten bewegliche Sachen"]
[null,"1.7","Werterhaltung/Reparaturkosten Räume/Grundstück"]
[null,"1.8","Abschreibungen auf Gebäude (ggf. anteilig entsprechend der Nutzungsfläche)                                                                                            "]
[null,"1.9","Gebühren/Beiträge/Steuern/ Versicherungen Gebäude/Inventar       "]
[null,"1.10","Reinigungsdienste"]
[null,"1.11"," Hausmeisterdienste"]
[{"$nulls":12},"Summe 1.",{"$f":"SUM(N4:P16)","v":0}]
["2. Ausgaben im Rahmen der sozialpäd. Arbeit","2.1","Verbrauchsmaterialien, geringwert.Wirtschaftsgüter und bewegliche Sachen für die inhaltliche Arbeit"]
[null,"2.2","Eintrittsgelder, Fahrtkosten für spontane Gruppenaktivitäten außer Haus"]
[null,"2.3","Ausgaben für Feste/Veranstaltungen (inkl. Honorar)"]
[null,"2.4","Honorare für Künstler/-innen und/oder Einzelprojektleitung\n(nicht für zeitlich begrenzte Maßnahmen, Feste/Veranstaltungen)"]
[null,"2.5","Lebensmittel für die päd. Arbeit  (keine Verpflegungskosten)"]
[null,"2.6","sonstige Ausgaben im Rahmen der sozialpädagogischen Arbeit \n(im Rahmen der Antragstellung)"]
[{"$nulls":12},"Summe 2.",{"$f":"SUM(N18:P23)","v":0}]
["3. weitere Sachausgaben","3.1","Telekommunikation, Internetnutzung"]
[null,"3.2","Geringwert. Wirtschaftsgüter und bewegliche Sachen (ausgenommen 2.1)"]
[null,"3.3","Ausgaben für Dienst-Kfz  (i. d. R. anteilig entsprechend dem Nutzungsanteil für das Angebot)"]
[null,"3.4","Dienstgänge: \nFahrtkostenerstattung Nutzung Privat-Kfz / Stadtfahrten (Fahrkarten)",null,"Privat-Kfz","überwiegende Nutzung                                für das Angebot?"]
[null,"3.5","Fort- u. Weiterbildungskosten (einschl. Reise- und Übernachtungskosten), Ausgaben für Fachtagungen/Supervision für haupt- und nebenberufliche Mitarbeiter/-innen"]
[null,"3.6","Ausgaben für Freiwilligendienste/Ausbildungsvergütung für angehende Fachkräfte"]
[null,"3.7","Aufwandsentschädigung Ehrenamtliche/Praktikanten"]
[null,"3.8","sonstige Ausgaben (im Rahmen der Antragstellung)"]
[{"$nulls":12},"Summe 3.",{"$f":"SUM(N25:P32)","v":0}]
["4. Verwaltung","4.1","Verwaltungsaufwendungen im Angebot (z.B. Büromaterial, Porto, öff. Bekanntmachungen, Anschaffung/Leasing/Wartung Bürotechnik)"]
[null,"4.2","Verwaltungsumlage (Sach- und Personalausgaben für die zentrale Verwaltung, Planung, Steuerung und Kontrolle; gilt nicht bei Geschäftsstellenförderung)"]
["5. zeitlich begrenzte Maßnahmen","5.1","Bildungsmaßnahmen (BM) gesamt (Summe der Folgeblätter)",{"$nulls":10},{"$f":"'BM I (1)'!U43+'BM II (1)'!Y55","v":{"v":0,"d":"0.00"}}]
[null,"5.2","Erlebnispädagogische Maßnahmen (EPM) gesamt (Summe der Folgeblätter)",{"$nulls":10},{"$f":"'EPM (1)'!T44","v":{"v":0,"d":"0.00"}}]
["Sachausgaben gesamt:",{"$nulls":12},{"$f":"N17+N24+N33+N34+N35+N36+N37","v":{"v":0,"d":"0.00"}}]

{"sheet":"Abschreibungen","index":3,"n_rows":28,"n_cols":6,"rows_kept":28,"merged":[[3,0,3,5],[5,0,5,1],[5,2,5,5],[7,0,7,1],[7,2,7,3],[9,0,9,1],[11,0,11,1],[13,0,13,1],[15,0,15,1],[17,0,17,1],[19,0,19,1],[21,0,21,1],[23,0,23,1],[25,0,25,5]]}
["Landeshauptstadt Dresden - Jugendamt",null,{"$f":"Deckblatt!R1","v":"Verwendungsnachweis 2019/2020"},null,null,{"$f":"Deckblatt!K4","v":0}]
[]
["Berechnung Abschreibungen auf Gebäude"]
["Das Gebäude muss sich im Eigentum des Träger befinden. Es werden nur für die Flächen, die durch das Jugendhilfeangebot genutzt werden, Abschreibungen als zuwendungsfähig anerkannt. Grundlage der Berechnung sind die Anschaffungs- oder Herstellungskosten für das Gebäude, welche um die öffentlichen Zuschüsse, welche seit 1991 in die Anschaffung oder Herstellung des Gebäudes geflossen sind, zu bereinigen sind. Der verbleibende Betrag, herunter gebrochen auf die Nutzungsfläche für das Angebot, wird entsprechend der festgelegten Nutzungsdauer (siehe AfA-Tabelle, max. über 60 Jahre) linear abgeschrieben."]
[]
["Gebäudeanschrift:"]
[]
["Zeitpunkt der Anschaffung (Monat/Jahr):"]
[]
["Kosten der Anschaffung/Herstellung:",null,null,"Euro","brutto od. netto:"]
[]
["öffentliche Zuschüsse seit 1991:",null,null,"Euro"]
[]
["um öffentliche Zuschüsse bereinigte Anschaffungs-/ Herstellungskosten:",null,{"$f":"C10-C12","v":0},"Euro"]
[]
["Nutzungsdauer gemäß \nAfA-Tabelle:",null,null,"Jahre"]
[]
["zuwendungsfähige Abschreibung ganzes Gebäude ",null,null,"Euro im Jahr"]
[]
["Nutzung des Gebäudes durch das Angebot:",null,null,"Prozent"]
[]
["Abschreibungssatz für das Jugendhilfeangebot:",null,{"$f":"C18*C20/100","v":0},"Euro im Jahr"]
[]
["Abschreibungen auf den Abrechnungszeitraum gekürzt \n(sofern keine ganzjährige Förderung):",null,null,"Euro im Bewilligungszeitraum"]
[]
["Sofern noch nicht im Jugendamt vorliegend, ist ein Nachweis über die Anschaffungs- und Herstellungskosten sowie ein Raumbelegungsplan (Flächen in qm gesamt/Ausweisung der Flächen in qm, die durch das Angebot dauerhaft genutzt werden) bei anteiliger Nutzung mit einzureichen."]
[]
["https://www.smart-rechner.de/abschreibung/ratgeber/abschreibung_gebaeude.php"]

{"sheet":"BM I (1)","index":4,"n_rows":45,"n_cols":24,"rows_kept":45,"merged":[[0,13,0,16],[2,0,2,9],[2,14,2,16],[3,0,3,13],[5,0,6,0],[5,1,6,3],[5,6,6,7],[5,11,5,13],[5,14,5,16],[5,19,14,19],[6,11,6,13],[6,14,6,16],[7,0,11,0],[7,10,8,10],[7,11,8,13],[7,14,8,16],[8,1,9,4],[8,5,9,5],[8,6,9,8],[8,9,9,9],[9,10,10,10],[9,11,10,13],[9,14,10,16],[10,1,11,4],[10,5,11,5],[10,6,11,8],[10,9,11,9],[11,10,12,10],[11,11,12,13],[11,14,12,16],[12,0,14,5],[12,6,12,7],[12,8,12,9],[13,6,14,7],[13,8,14,9],[13,10,14,10],[13,11,14,13],[13,14,14,16],[15,0,15,16],[16,0,16,16],[18,0,19,0],[18,1,19,3],[18,6,19,7],[18,11,18,13],[18,14,18,16],[19,11,19,13],[19,14,19,16],[20,0,24,0],[20,10,21,10],[20,11,21,13],[20,14,21,16],[21,1,22,4],[21,5,22,5],[21,6,22,8],[21,9,22,9],[22,10,23,10],[22,11,23,13],[22,14,23,16],[23,1,24,4],[23,5,24,5],[23,6,24,8],[23,9,24,9],[24,10,25,10],[24,11,25,13],[24,14,25,16],[25,0,27,5],[25,6,25,7],[25,8,25,9],[26,6,27,7],[26,8,27,9],[26,10,27,10],[26,11,27,13],[26,14,27,16],[28,0,28,16],[29,0,29,16],[31,0,32,0],[31,1,32,3],[31,6,32,7],[31,11,31,13],[31,14,31,16],[31,20,31,22],[31,23,31,25],[32,11,32,13],[32,14,32,16],[32,20,32,22],[32,23,32,25],[33,0,37,0],[33,10,34,10],[33,11,34,13],[33,14,34,16],[33,19,34,19],[33,20,34,22],[33,23,34,25],[34,1,35,4],[34,5,35,5],[34,6,35,8],[34,9,35,9],[35,10,36,10],[35,11,36,13],[35,14,36,16],[35,19,36,19],[35,20,36,22],[35,23,36,25],[36,1,37,4],[36,5,37,5],[36,6,37,8],[36,9,37,9],[37,10,38,10],[37,11,38,13],[37,14,38,16],[37,19,38,19],[37,20,38,22],[37,23,38,25],[38,0,40,5],[38,6,38,7],[38,8,38,9],[39,6,40,7],[39,8,40,9],[39,10,40,10],[39,11,40,13],[39,14,40,16],[39,19,40,19],[39,20,40,22],[39,23,40,25],[41,0,41,16],[42,0,42,16],[42,20,42,22],[42,23,42,25]]}
["Landeshauptstadt Dresden - Jugendamt",{"$nulls":8},{"$f":"Deckblatt!R1","v":"Verwendungsnachweis 2019/2020"},null,null,"AZ:",{"$f":"Deckblatt!K4","v":0}]
[]
["Bildungsmaßnahmen",{"$nulls":9},{"$f":"Deckblatt!P24","v":0},{"$nulls":3},"BM I - Blatt 1"]
["Seminare/Exkursionen mit mind. 6 Seminar-/Exkursionsstunden pro Tag"]
[]
["1.","Tage ohne                             Übernachtung:",null,null,"Tage","TN*","Tage mit                                        Übernachtung:",null,"Anzahl der Ü","TN*","Ausgaben ","in EUR",null,null,"max. möglicher Zuschuss",{"$nulls":4},"Besteht eine BM z.B. aus 2 Tagen mit je 6 Seminar-/Exkursionsstunden und einer Übernachtung, ist ein Tag ohne Übernachtung und ein Tag mit Übernachtung einzutragen."]
[{"$nulls":10},"Honorarkosten",{"$nulls":3},{"$f":"IF(((F9+F11+J9+J11)*25)>L7,L7,((F9+F11+J9+J11)*25))","v":0}]
["Referenten","Name, Vorname",{"$nulls":3},"Stunden","Name, Vorname",null,null,"Stunden","Fahrt-, Reise-,                     Transportkosten",{"$nulls":3},{"$f":"IF(E7+F7+I7+J7=0,0,L8*35/100)","v":0}]
[]
[{"$nulls":10},"Betreuerkosten",{"$nulls":3},{"$f":"IF((O12*12.5/100)<L10,(O12*12.5/100),L10)","v":0}]
[]
[{"$nulls":10},"weitere Ausgaben (z. B. f. Unterkunft, Programmkosten)",{"$nulls":3},{"$f":"(E7*F7*5)+(I7*J7*10)","v":0}]
["eingenommene Teilnahmebeiträge",{"$nulls":5},"EUR pro Person",null,"EUR gesamt"]
[{"$nulls":10},"Summe",{"$f":"SUM(L7:N12)","v":0},null,null,{"$f":"IF(L14-I14<          (IF((SUM(O7:Q13))>L14,L14,(SUM(O7:Q13)))), L14-I14,  (IF((SUM(O7:Q13))>L14,L14,(SUM(O7:Q13)))))","v":0}]
[]
["Kurzbeschreibung (Inhalt, Zielgruppe, Datum von-bis)"]
[{"$nulls":19},"Sie möchten Absätze im Eingabefeld einfügen? \n-> Alt+Enter"]
[]
["2.","Tage ohne                             Übernachtung:",null,null,"Tage","TN*","Tage mit                                        Übernachtung:",null,"Anzahl der Ü","TN*","Ausgaben ","in EUR",null,null,"max. möglicher Zuschuss"]
[{"$nulls":10},"Honorarkosten",{"$nulls":3},{"$f":"IF(((F22+F24+J22+J24)*25)>L20,L20,((F22+F24+J22+J24)*25))","v":0}]
["Referenten","Name, Vorname",{"$nulls":3},"Stunden","Name, Vorname",null,null,"Stunden","Fahrt-, Reise-,                     Transportkosten",{"$nulls":3},{"$f":"IF(E20+F20+I20+J20=0,0,L21*35/100)","v":0}]
[]
[{"$nulls":10},"Betreuerkosten",{"$nulls":3},{"$f":"IF((O25*12.5/100)<L23,(O25*12.5/100),L23)","v":0}]
[]
[{"$nulls":10},"weitere Ausgaben (z. B. f. Unterkunft, Programmkosten)",{"$nulls":3},{"$f":"(E20*F20*5)+(I20*J20*10)","v":0}]
["eingenommene Teilnahmebeiträge",{"$nulls":5},"EUR pro Person",null,"EUR gesamt"]
[{"$nulls":10},"Summe",{"$f":"SUM(L20:N25)","v":0},null,null,{"$f":"IF(L27-I27<          (IF((SUM(O20:Q26))>L27,L27,(SUM(O20:Q26)))), L27-I27,  (IF((SUM(O20:Q26))>L27,L27,(SUM(O20:Q26)))))","v":0}]
[]
["Kurzbeschreibung (Inhalt, Zielgruppe, Datum von-bis)"]
[]
[]
["3.","Tage ohne                             Übernachtung:",null,null,"Tage","TN*","Tage mit                                        Übernachtung:",null,"Anzahl der Ü","TN*","Ausgaben ","in EUR",null,null,"max. möglicher Zuschuss",{"$nulls":4},"Blattsummen","in EUR",null,null,"max. möglicher Zuschuss"]
[{"$nulls":10},"Honorarkosten",{"$nulls":3},{"$f":"IF(((F35+F37+J35+J37)*25)>L33,L33,((F35+F37+J35+J37)*25))","v":0},{"$nulls":4},"Honorarkosten",{"$f":"L7+L20+L33","v":{"v":0,"d":"0.00"}}]
["Referenten","Name, Vorname",{"$nulls":3},"Stunden","Name, Vorname",null,null,"Stunden","Fahrt-, Reise-,                     Transportkosten",{"$nulls":3},{"$f":"IF(E33+F33+I33+J33=0,0,L34*35/100)","v":0},{"$nulls":4},"Fahrt-, Reise-,                     Transportkosten",{"$f":"L8+L21+L34","v":{"v":0,"d":"0.00"}}]
[]
[{"$nulls":10},"Betreuerkosten",{"$nulls":3},{"$f":"IF((O38*12.5/100)<L36,(O38*12.5/100),L36)","v":0},{"$nulls":4},"Betreuungskosten",{"$f":"L10+L23+L36","v":{"v":0,"d":"0.00"}}]
[]
[{"$nulls":10},"weitere Ausgaben (z. B. f. Unterkunft, Programmkosten)",{"$nulls":3},{"$f":"(E33*F33*5)+(I33*J33*10)","v":0},{"$nulls":4},"weitere Ausgaben (z. B. f. Unterkunft, Programmkosten)",{"$f":"L12+L25+L38","v":{"v":0,"d":"0.00"}}]
["eingenommene Teilnahmebeiträge",{"$nulls":5},"EUR pro Person",null,"EUR gesamt"]
[{"$nulls":10},"Summe",{"$f":"SUM(L33:N38)","v":0},null,null,{"$f":"IF(L40-I40<          (IF((SUM(O33:Q39))>L40,L40,(SUM(O33:Q39)))), L40-I40,  (IF((SUM(O33:Q39))>L40,L40,(SUM(O33:Q39)))))","v":0},{"$nulls":4},"Summe",{"$f":"SUM(U33:W39)","v":0},null,null,{"$f":"O14+O27+O40","v":0}]
[]
["Kurzbeschreibung (Inhalt, Zielgruppe, Datum von-bis)"]
[{"$nulls":19},"Summe BM I",{"$f":"SUM('BM I (2):BM I (8)'!U40)+U40","v":0},null,null,{"$f":"SUM('BM I (2):BM I (8)'!X40:Z41)+X40","v":0}]
["Die Beschreibung der Maßnahmen kann auch formlos auf einem extra Blatt erfolgen. Teilnahmelisten sind beizufügen!"]
["*TN: Teilnehmer/-innen"]

{"sheet":"BM I (2)","index":5,"n_rows":45,"n_cols":24,"rows_kept":45,"merged":[[0,13,0,16],[2,0,2,9],[2,14,2,16],[3,0,3,13],[5,0,6,0],[5,1,6,3],[5,6,6,7],[5,11,5,13],[5,14,5,16],[5,19,14,19],[6,11,6,13],[6,14,6,16],[7,0,11,0],[7,10,8,10],[7,11,8,13],[7,14,8,16],[8,1,9,4],[8,5,9,5],[8,6,9,8],[8,9,9,9],[9,10,10,10],[9,11,10,13],[9,14,10,16],[10,1,11,4],[10,5,11,5],[10,6,11,8],[10,9,11,9],[11,10,12,10],[11,11,12,13],[11,14,12,16],[12,0,14,5],[12,6,12,7],[12,8,12,9],[13,6,14,7],[13,8,14,9],[13,10,14,10],[13,11,14,13],[13,14,14,16],[15,0,15,16],[16,0,16,16],[18,0,19,0],[18,1,19,3],[18,6,19,7],[18,11,18,13],[18,14,18,16],[19,11,19,13],[19,14,19,16],[20,0,24,0],[20,10,21,10],[20,11,21,13],[20,14,21,16],[21,1,22,4],[21,5,22,5],[21,6,22,8],[21,9,22,9],[22,10,23,10],[22,11,23,13],[22,14,23,16],[23,1,24,4],[23,5,24,5],[23,6,24,8],[23,9,24,9],[24,10,25,10],[24,11,25,13],[24,14,25,16],[25,0,27,5],[25,6,25,7],[25,8,25,9],[26,6,27,7],[26,8,27,9],[26,10,27,10],[26,11,27,13],[26,14,27,16],[28,0,28,16],[29,0,29,16],[31,0,32,0],[31,1,32,3],[31,6,32,7],[31,11,31,13],[31,14,31,16],[31,20,31,22],[31,23,31,25],[32,11,32,13],[32,14,32,16],[32,20,32,22],[32,23,32,25],[33,0,37,0],[33,10,34,10],[33,11,34,13],[33,14,34,16],[33,19,34,19],[33,20,34,22],[33,23,34,25],[34,1,35,4],[34,5,35,5],[34,6,35,8],[34,9,35,9],[35,10,36,10],[35,11,36,13],[35,14,36,16],[35,19,36,19],[35,20,36,22],[35,23,36,25],[36,1,37,4],[36,5,37,5],[36,6,37,8],[36,9,37,9],[37,10,38,10],[37,11,38,13],[37,14,38,16],[37,19,38,19],[37,20,38,22],[37,23,38,25],[38,0,40,5],[38,6,38,7],[38,8,38,9],[39,6,40,7],[39,8,40,9],[39,10,40,10],[39,11,40,13],[39,14,40,16],[39,19,40,19],[39,20,40,22],[39,23,40,25],[41,0,41,16],[42,0,42,16]]}
["Landeshauptstadt Dresden - Jugendamt",{"$nulls":8},{"$f":"Deckblatt!R1","v":"Verwendungsnachweis 2019/2020"},null,null,"AZ:",{"$f":"Deckblatt!K4","v":0}]
[]
["Bildungsmaßnahmen",{"$nulls":9},{"$f":"Deckblatt!P24","v":0},{"$nulls":3},"BM I - Blatt 2"]
["Seminare/Exkursionen mit mind. 6 Seminar-/Exkursionsstunden pro Tag"]
[]
["4.","Tage ohne                             Übernachtung:",null,null,"Tage","TN*","Tage mit                                        Übernachtung:",null,"Anzahl der Ü","TN*","Ausgaben ","in EUR",null,null,"max. möglicher Zuschuss",{"$nulls":4},"Besteht eine BM z.B. aus 2 Tagen mit je 6 Seminar-/Exkursionsstunden und einer Übernachtung, ist ein Tag ohne Übernachtung und ein Tag mit Übernachtung einzutragen."]
[{"$nulls":10},"Honorarkosten",{"$nulls":3},{"$f":"IF(((F9+F11+J9+J11)*25)>L7,L7,((F9+F11+J9+J11)*25))","v":0}]
["Referenten","Name, Vorname",{"$nulls":3},"Stunden","Name, Vorname",null,null,"Stunden","Fahrt-, Reise-,                     Transportkosten",{"$nulls":3},{"$f":"IF(E7+F7+I7+J7=0,0,L8*35/100)","v":0}]
[]
[{"$nulls":10},"Betreuerskosten",{"$nulls":3},{"$f":"IF((O12*12.5/100)<L10,(O12*12.5/100),L10)","v":0}]
[]
[{"$nulls":10},"weitere Ausgaben (z. B. f. Unterkunft, Programmkosten)",{"$nulls":3},{"$f":"(E7*F7*5)+(I7*J7*10)","v":0}]
["eingenommene Teilnahmebeiträge",{"$nulls":5},"EUR pro Person",null,"EUR gesamt"]
[{"$nulls":10},"Summe",{"$f":"SUM(L7:N12)","v":0},null,null,{"$f":"IF(L14-I14<          (IF((SUM(O7:Q13))>L14,L14,(SUM(O7:Q13)))), L14-I14,  (IF((SUM(O7:Q13))>L14,L14,(SUM(O7:Q13)))))","v":0}]
[]
["Kurzbeschreibung (Inhalt, Zielgruppe, Datum von-bis)"]
[{"$nulls":19},"Sie möchten Absätze im Eingabefeld einfügen? \n-> Alt+Enter"]
[]
["5.","Tage ohne                             Übernachtung:",null,null,"Tage","TN*","Tage mit                                        Übernachtung:",null,"Anzahl der Ü","TN*","Ausgaben ","in EUR",null,null,"max. möglicher Zuschuss"]
[{"$nulls":10},"Honorarkosten",{"$nulls":3},{"$f":"IF(((F22+F24+J22+J24)*25)>L20,L20,((F22+F24+J22+J24)*25))","v":0}]
["Referenten","Name, Vorname",{"$nulls":3},"Stunden","Name, Vorname",null,null,"Stunden","Fahrt-, Reise-,                     Transportkosten",{"$nulls":3},{"$f":"IF(E20+F20+I20+J20=0,0,L21*35/100)","v":0}]
[]
[{"$nulls":10},"Betreuerskosten",{"$nulls":3},{"$f":"IF((O25*12.5/100)<L23,(O25*12.5/100),L23)","v":0}]
[]
[{"$nulls":10},"weitere Ausgaben (z. B. f. Unterkunft, Programmkosten)",{"$nulls":3},{"$f":"(E20*F20*5)+(I20*J20*10)","v":0}]
["eingenommene Teilnahmebeiträge",{"$nulls":5},"EUR pro Person",null,"EUR gesamt"]
[{"$nulls":10},"Summe",{"$f":"SUM(L20:N25)","v":0},null,null,{"$f":"IF(L27-I27<          (IF((SUM(O20:Q26))>L27,L27,(SUM(O20:Q26)))), L27-I27,  (IF((SUM(O20:Q26))>L27,L27,(SUM(O20:Q26)))))","v":0}]
[]
["Kurzbeschreibung (Inhalt, Zielgruppe, Datum von-bis)"]
[]
[]
["6.","Tage ohne                             Übernachtung:",null,null,"Tage","TN*","Tage mit                                        Übernachtung:",null,"Anzahl der Ü","TN*","Ausgaben ","in EUR",null,null,"max. möglicher Zuschuss",{"$nulls":4},"Blattsummen","in EUR",null,null,"max. möglicher Zuschuss"]
[{"$nulls":10},"Honorarkosten",{"$nulls":3},{"$f":"IF(((F35+F37+J35+J37)*25)>L33,L33,((F35+F37+J35+J37)*25))","v":0},{"$nulls":4},"Honorarkosten",{"$f":"L7+L20+L33","v":{"v":0,"d":"0.00"}}]
["Referenten","Name, Vorname",{"$nulls":3},"Stunden","Name, Vorname",null,null,"Stunden","Fahrt-, Reise-,                     Transportkosten",{"$nulls":3},{"$f":"IF(E33+F33+I33+J33=0,0,L34*35/100)","v":0},{"$nulls":4},"Fahrt-, Reise-,                     Transportkosten",{"$f":"L8+L21+L34","v":{"v":0,"d":"0.00"}}]
[]
[{"$nulls":10},"Betreuerskosten",{"$nulls":3},{"$f":"IF((O38*12.5/100)<L36,(O38*12.5/100),L36)","v":0},{"$nulls":4},"Betreuungskosten",{"$f":"L10+L23+L36","v":{"v":0,"d":"0.00"}}]
[]
[{"$nulls":10},"weitere Ausgaben (z. B. f. Unterkunft, Programmkosten)",{"$nulls":3},{"$f":"(E33*F33*5)+(I33*J33*10)","v":0},{"$nulls":4},"weitere Ausgaben (z. B. f. Unterkunft, Programmkosten)",{"$f":"L12+L25+L38","v":{"v":0,"d":"0.00"}}]
["eingenommene Teilnahmebeiträge",{"$nulls":5},"EUR pro Person",null,"EUR gesamt"]
[{"$nulls":10},"Summe",{"$f":"SUM(L33:N38)","v":0},null,null,{"$f":"IF(L40-I40<          (IF((SUM(O33:Q39))>L40,L40,(SUM(O33:Q39)))), L40-I40,  (IF((SUM(O33:Q39))>L40,L40,(SUM(O33:Q39)))))","v":0},{"$nulls":4},"Summe",{"$f":"SUM(U33:W39)","v":0},null,null,{"$f":"O14+O27+O40","v":0}]
[]
["Kurzbeschreibung (Inhalt, Zielgruppe, Datum von-bis)"]
[]
["Die Beschreibung der Maßnahmen kann auch formlos auf einem extra Blatt erfolgen. Teilnahmelisten sind beizufügen!"]
["*TN: Teilnehmer/-innen"]

{"sheet":"BM I (3)","index":6,"n_rows":45,"n_cols":24,"rows_kept":45,"merged":[[0,13,0,16],[2,0,2,9],[2,14,2,16],[3,0,3,13],[5,0,6,0],[5,1,6,3],[5,6,6,7],[5,11,5,13],[5,14,5,16],[5,19,14,19],[6,11,6,13],[6,14,6,16],[7,0,11,0],[7,10,8,10],[7,11,8,13],[7,14,8,16],[8,1,9,4],[8,5,9,5],[8,6,9,8],[8,9,9,9],[9,10,10,10],[9,11,10,13],[9,14,10,16],[10,1,11,4],[10,5,11,5],[10,6,11,8],[10,9,11,9],[11,10,12,10],[11,11,12,13],[11,14,12,16],[12,0,14,5],[12,6,12,7],[12,8,12,9],[13,6,14,7],[13,8,14,9],[13,10,14,10],[13,11,14,13],[13,14,14,16],[15,0,15,16],[16,0,16,16],[18,0,19,0],[18,1,19,3],[18,6,19,7],[18,11,18,13],[18,14,18,16],[19,11,19,13],[19,14,19,16],[20,0,24,0],[20,10,21,10],[20,11,21,13],[20,14,21,16],[21,1,22,4],[21,5,22,5],[21,6,22,8],[21,9,22,9],[22,10,23,10],[22,11,23,13],[22,14,23,16],[23,1,24,4],[23,5,24,5],[23,6,24,8],[23,9,24,9],[24,10,25,10],[24,11,25,13],[24,14,25,16],[25,0,27,5],[25,6,25,7],[25,8,25,9],[26,6,27,7],[26,8,27,9],[26,10,27,10],[26,11,27,13],[26,14,27,16],[28,0,28,16],[29,0,29,16],[31,0,32,0],[31,1,32,3],[31,6,32,7],[31,11,31,13],[31,14,31,16],[31,20,31,22],[31,23,31,25],[32,11,32,13],[32,14,32,16],[32,20,32,22],[32,23,32,25],[33,0,37,0],[33,10,34,10],[33,11,34,13],[33,14,34,16],[33,19,34,19],[33,20,34,22],[33,23,34,25],[34,1,35,4],[34,5,35,5],[34,6,35,8],[34,9,35,9],[35,10,36,10],[35,11,36,13],[35,14,36,16],[35,19,36,19],[35,20,36,22],[35,23,36,25],[36,1,37,4],[36,5,37,5],[36,6,37,8],[36,9,37,9],[37,10,38,10],[37,11,38,13],[37,14,38,16],[37,19,38,19],[37,20,38,22],[37,23,38,25],[38,0,40,5],[38,6,38,7],[38,8,38,9],[39,6,40,7],[39,8,40,9],[39,10,40,10],[39,11,40,13],[39,14,40,16],[39,19,40,19],[39,20,40,22],[39,23,40,25],[41,0,41,16],[42,0,42,16]]}
["Landeshauptstadt Dresden - Jugendamt",{"$nulls":8},{"$f":"Deckblatt!R1","v":"Verwendungsnachweis 2019/2020"},null,null,"AZ:",{"$f":"Deckblatt!K4","v":0}]
[]
["Bildungsmaßnahmen",{"$nulls":9},{"$f":"Deckblatt!P24","v":0},{"$nulls":3},"BM I - Blatt 3"]
["Seminare/Exkursionen mit mind. 6 Seminar-/Exkursionsstunden pro Tag"]
[]
["7.","Tage ohne                             Übernachtung:",null,null,"Tage","TN*","Tage mit                                        Übernachtung:",null,"Anzahl der Ü","TN*","Ausgaben ","in EUR",null,null,"max. möglicher Zuschuss",{"$nulls":4},"Besteht eine BM z.B. aus 2 Tagen mit je 6 Seminar-/Exkursionsstunden und einer Übernachtung, ist ein Tag ohne Übernachtung und ein Tag mit Übernachtung einzutragen."]
[{"$nulls":10},"Honorarkosten",{"$nulls":3},{"$f":"IF(((F9+F11+J9+J11)*25)>L7,L7,((F9+F11+J9+J11)*25))","v":0}]
["Referenten","Name, Vorname",{"$nulls":3},"Stunden","Name, Vorname",null,null,"Stunden","Fahrt-, Reise-,                     Transportkosten",{"$nulls":3},{"$f":"IF(E7+F7+I7+J7=0,0,L8*35/100)","v":0}]
[]
[{"$nulls":10},"Betreuerkosten",{"$nulls":3},{"$f":"IF((O12*12.5/100)<L10,(O12*12.5/100),L10)","v":0}]
[]
[{"$nulls":10},"weitere Ausgaben (z. B. f. Unterkunft, Programmkosten)",{"$nulls":3},{"$f":"(E7*F7*5)+(I7*J7*10)","v":0}]
["eingenommene Teilnahmebeiträge",{"$nulls":5},"EUR pro Person",null,"EUR gesamt"]
[{"$nulls":10},"Summe",{"$f":"SUM(L7:N12)","v":0},null,null,{"$f":"IF(L14-I14<          (IF((SUM(O7:Q13))>L14,L14,(SUM(O7:Q13)))), L14-I14,  (IF((SUM(O7:Q13))>L14,L14,(SUM(O7:Q13)))))","v":0}]
[]
["Kurzbeschreibung (Inhalt, Zielgruppe, Datum von-bis)"]
[{"$nulls":19},"Sie möchten Absätze im Eingabefeld einfügen? \n-> Alt+Enter"]
[]
["8.","Tage ohne                             Übernachtung:",null,null,"Tage","TN*","Tage mit                                        Übernachtung:",null,"Anzahl der Ü","TN*","Ausgaben ","in EUR",null,null,"max. möglicher Zuschuss"]
[{"$nulls":10},"Honorarkosten",{"$nulls":3},{"$f":"IF(((F22+F24+J22+J24)*25)>L20,L20,((F22+F24+J22+J24)*25))","v":0}]
["Referenten","Name, Vorname",{"$nulls":3},"Stunden","Name, Vorname",null,null,"Stunden","Fahrt-, Reise-,                     Transportkosten",{"$nulls":3},{"$f":"IF(E20+F20+I20+J20=0,0,L21*35/100)","v":0}]
[]
[{"$nulls":10},"Betreuerkosten",{"$nulls":3},{"$f":"IF((O25*12.5/100)<L23,(O25*12.5/100),L23)","v":0}]
[]
[{"$nulls":10},"weitere Ausgaben (z. B. f. Unterkunft, Programmkosten)",{"$nulls":3},{"$f":"(E20*F20*5)+(I20*J20*10)","v":0}]
["eingenommene Teilnahmebeiträge",{"$nulls":5},"EUR pro Person",null,"EUR gesamt"]
[{"$nulls":10},"Summe",{"$f":"SUM(L20:N25)","v":0},null,null,{"$f":"IF(L27-I27<          (IF((SUM(O20:Q26))>L27,L27,(SUM(O20:Q26)))), L27-I27,  (IF((SUM(O20:Q26))>L27,L27,(SUM(O20:Q26)))))","v":0}]
[]
["Kurzbeschreibung (Inhalt, Zielgruppe, Datum von-bis)"]
[]
[]
["9.","Tage ohne                             Übernachtung:",null,null,"Tage","TN*","Tage mit                                        Übernachtung:",null,"Anzahl der Ü","TN*","Ausgaben ","in EUR",null,null,"max. möglicher Zuschuss",{"$nulls":4},"Blattsummen","in EUR",null,null,"max. möglicher Zuschuss"]
[{"$nulls":10},"Honorarkosten",{"$nulls":3},{"$f":"IF(((F35+F37+J35+J37)*25)>L33,L33,((F35+F37+J35+J37)*25))","v":0},{"$nulls":4},"Honorarkosten",{"$f":"L7+L20+L33","v":{"v":0,"d":"0.00"}}]
["Referenten","Name, Vorname",{"$nulls":3},"Stunden","Name, Vorname",null,null,"Stunden","Fahrt-, Reise-,                     Transportkosten",{"$nulls":3},{"$f":"IF(E33+F33+I33+J33=0,0,L34*35/100)","v":0},{"$nulls":4},"Fahrt-, Reise-,                     Transportkosten",{"$f":"L8+L21+L34","v":{"v":0,"d":"0.00"}}]
[]
[{"$nulls":10},"Betreuerkosten",{"$nulls":3},{"$f":"IF((O38*12.5/100)<L36,(O38*12.5/100),L36)","v":0},{"$nulls":4},"Betreuungskosten",{"$f":"L10+L23+L36","v":{"v":0,"d":"0.00"}}]
[]
[{"$nulls":10},"weitere Ausgaben (z. B. f. Unterkunft, Programmkosten)",{"$nulls":3},{"$f":"(E33*F33*5)+(I33*J33*10)","v":0},{"$nulls":4},"weitere Ausgaben (z. B. f. Unterkunft, Programmkosten)",{"$f":"L12+L25+L38","v":{"v":0,"d":"0.00"}}]
["eingenommene Teilnahmebeiträge",{"$nulls":5},"EUR pro Person",null,"EUR gesamt"]
[{"$nulls":10},"Summe",{"$f":"SUM(L33:N38)","v":0},null,null,{"$f":"IF(L40-I40<          (IF((SUM(O33:Q39))>L40,L40,(SUM(O33:Q39)))), L40-I40,  (IF((SUM(O33:Q39))>L40,L40,(SUM(O33:Q39)))))","v":0},{"$nulls":4},"Summe",{"$f":"SUM(U33:W39)","v":0},null,null,{"$f":"O14+O27+O40","v":0}]
[]
["Kurzbeschreibung (Inhalt, Zielgruppe, Datum von-bis)"]
[]
["Die Beschreibung der Maßnahmen kann auch formlos auf einem extra Blatt erfolgen. Teilnahmelisten sind beizufügen!"]
["*TN: Teilnehmer/-innen"]

{"sheet":"BM I (4)","index":7,"n_rows":45,"n_cols":24,"rows_kept":45,"merged":[[0,13,0,16],[2,0,2,9],[2,14,2,16],[3,0,3,13],[5,0,6,0],[5,1,6,3],[5,6,6,7],[5,11,5,13],[5,14,5,16],[5,19,14,19],[6,11,6,13],[6,14,6,16],[7,0,11,0],[7,10,8,10],[7,11,8,13],[7,14,8,16],[8,1,9,4],[8,5,9,5],[8,6,9,8],[8,9,9,9],[9,10,10,10],[9,11,10,13],[9,14,10,16],[10,1,11,4],[10,5,11,5],[10,6,11,8],[10,9,11,9],[11,10,12,10],[11,11,12,13],[11,14,12,16],[12,0,14,5],[12,6,12,7],[12,8,12,9],[13,6,14,7],[13,8,14,9],[13,10,14,10],[13,11,14,13],[13,14,14,16],[15,0,15,16],[16,0,16,16],[18,0,19,0],[18,1,19,3],[18,6,19,7],[18,11,18,13],[18,14,18,16],[19,11,19,13],[19,14,19,16],[20,0,24,0],[20,10,21,10],[20,11,21,13],[20,14,21,16],[21,1,22,4],[21,5,22,5],[21,6,22,8],[21,9,22,9],[22,10,23,10],[22,11,23,13],[22,14,23,16],[23,1,24,4],[23,5,24,5],[23,6,24,8],[23,9,24,9],[24,10,25,10],[24,11,25,13],[24,14,25,16],[25,0,27,5],[25,6,25,7],[25,8,25,9],[26,6,27,7],[26,8,27,9],[26,10,27,10],[26,11,27,13],[26,14,27,16],[28,0,28,16],[29,0,29,16],[31,0,32,0],[31,1,32,3],[31,6,32,7],[31,11,31,13],[31,14,31,16],[31,20,31,22],[31,23,31,25],[32,11,32,13],[32,14,32,16],[32,20,32,22],[32,23,32,25],[33,0,37,0],[33,10,34,10],[33,11,34,13],[33,14,34,16],[33,19,34,19],[33,20,34,22],[33,23,34,25],[34,1,35,4],[34,5,35,5],[34,6,35,8],[34,9,35,9],[35,10,36,10],[35,11,36,13],[35,14,36,16],[35,19,36,19],[35,20,36,22],[35,23,36,25],[36,1,37,4],[36,5,37,5],[36,6,37,8],[36,9,37,9],[37,10,38,10],[37,11,38,13],[37,14,38,16],[37,19,38,19],[37,20,38,22],[37,23,38,25],[38,0,40,5],[38,6,38,7],[38,8,38,9],[39,6,40,7],[39,8,40,9],[39,10,40,10],[39,11,40,13],[39,14,40,16],[39,19,40,19],[39,20,40,22],[39,23,40,25],[41,0,41,16],[42,0,42,16]]}
["Landeshauptstadt Dresden - Jugendamt",{"$nulls":8},{"$f":"Deckblatt!R1","v":"Verwendungsnachweis 2019/2020"},null,null,"AZ:",{"$f":"Deckblatt!K4","v":0}]
[]
["Bildungsmaßnahmen",{"$nulls":9},{"$f":"Deckblatt!P24","v":0},{"$nulls":3},"BM I - Blatt 4"]
["Seminare/Exkursionen mit mind. 6 Seminar-/Exkursionsstunden pro Tag"]
[]
["10.","Tage ohne                             Übernachtung:",null,null,"Tage","TN*","Tage mit                                        Übernachtung:",null,"Anzahl der Ü","TN*","Ausgaben ","in EUR",null,null,"max. möglicher Zuschuss",{"$nulls":4},"Besteht eine BM z.B. aus 2 Tagen mit je 6 Seminar-/Exkursionsstunden und einer Übernachtung, ist ein Tag ohne Übernachtung und ein Tag mit Übernachtung einzutragen."]
[{"$nulls":10},"Honorarkosten",{"$nulls":3},{"$f":"IF(((F9+F11+J9+J11)*25)>L7,L7,((F9+F11+J9+J11)*25))","v":0}]
["Referenten","Name, Vorname",{"$nulls":3},"Stunden","Name, Vorname",null,null,"Stunden","Fahrt-, Reise-,                     Transportkosten",{"$nulls":3},{"$f":"IF(E7+F7+I7+J7=0,0,L8*35/100)","v":0}]
[]
[{"$nulls":10},"Betreuerkosten",{"$nulls":3},{"$f":"IF((O12*12.5/100)<L10,(O12*12.5/100),L10)","v":0}]
[]
[{"$nulls":10},"weitere Ausgaben (z. B. f. Unterkunft, Programmkosten)",{"$nulls":3},{"$f":"(E7*F7*5)+(I7*J7*10)","v":0}]
["eingenommene Teilnahmebeiträge",{"$nulls":5},"EUR pro Person",null,"EUR gesamt"]
[{"$nulls":10},"Summe",{"$f":"SUM(L7:N12)","v":0},null,null,{"$f":"IF(L14-I14<          (IF((SUM(O7:Q13))>L14,L14,(SUM(O7:Q13)))), L14-I14,  (IF((SUM(O7:Q13))>L14,L14,(SUM(O7:Q13)))))","v":0}]
[]
["Kurzbeschreibung (Inhalt, Zielgruppe, Datum von-bis)"]
[{"$nulls":19},"Sie möchten Absätze im Eingabefeld einfügen? \n-> Alt+Enter"]
[]
["11.","Tage ohne                             Übernachtung:",null,null,"Tage","TN*","Tage mit                                        Übernachtung:",null,"Anzahl der Ü","TN*","Ausgaben ","in EUR",null,null,"max. möglicher Zuschuss"]
[{"$nulls":10},"Honorarkosten",{"$nulls":3},{"$f":"IF(((F22+F24+J22+J24)*25)>L20,L20,((F22+F24+J22+J24)*25))","v":0}]
["Referenten","Name, Vorname",{"$nulls":3},"Stunden","Name, Vorname",null,null,"Stunden","Fahrt-, Reise-,                     Transportkosten",{"$nulls":3},{"$f":"IF(E20+F20+I20+J20=0,0,L21*35/100)","v":0}]
[]
[{"$nulls":10},"Betreuerkosten",{"$nulls":3},{"$f":"IF((O25*12.5/100)<L23,(O25*12.5/100),L23)","v":0}]
[]
[{"$nulls":10},"weitere Ausgaben (z. B. f. Unterkunft, Programmkosten)",{"$nulls":3},{"$f":"(E20*F20*5)+(I20*J20*10)","v":0}]
["eingenommene Teilnahmebeiträge",{"$nulls":5},"EUR pro Person",null,"EUR gesamt"]
[{"$nulls":10},"Summe",{"$f":"SUM(L20:N25)","v":0},null,null,{"$f":"IF(L27-I27<          (IF((SUM(O20:Q26))>L27,L27,(SUM(O20:Q26)))), L27-I27,  (IF((SUM(O20:Q26))>L27,L27,(SUM(O20:Q26)))))","v":0}]
[]
["Kurzbeschreibung (Inhalt, Zielgruppe, Datum von-bis)"]
[]
[]
["12.","Tage ohne                             Übernachtung:",null,null,"Tage","TN*","Tage mit                                        Übernachtung:",null,"Anzahl der Ü","TN*","Ausgaben ","in EUR",null,null,"max. möglicher Zuschuss",{"$nulls":4},"Blattsummen","in EUR",null,null,"max. möglicher Zuschuss"]
[{"$nulls":10},"Honorarkosten",{"$nulls":3},{"$f":"IF(((F35+F37+J35+J37)*25)>L33,L33,((F35+F37+J35+J37)*25))","v":0},{"$nulls":4},"Honorarkosten",{"$f":"L7+L20+L33","v":{"v":0,"d":"0.00"}}]
["Referenten","Name, Vorname",{"$nulls":3},"Stunden","Name, Vorname",null,null,"Stunden","Fahrt-, Reise-,                     Transportkosten",{"$nulls":3},{"$f":"IF(E33+F33+I33+J33=0,0,L34*35/100)","v":0},{"$nulls":4},"Fahrt-, Reise-,                     Transportkosten",{"$f":"L8+L21+L34","v":{"v":0,"d":"0.00"}}]
[]
[{"$nulls":10},"Betreuerkosten",{"$nulls":3},{"$f":"IF((O38*12.5/100)<L36,(O38*12.5/100),L36)","v":0},{"$nulls":4},"Betreuungskosten",{"$f":"L10+L23+L36","v":{"v":0,"d":"0.00"}}]
[]
[{"$nulls":10},"weitere Ausgaben (z. B. f. Unterkunft, Programmkosten)",{"$nulls":3},{"$f":"(E33*F33*5)+(I33*J33*10)","v":0},{"$nulls":4},"weitere Ausgaben (z. B. f. Unterkunft, Programmkosten)",{"$f":"L12+L25+L38","v":{"v":0,"d":"0.00"}}]
["eingenommene Teilnahmebeiträge",{"$nulls":5},"EUR pro Person",null,"EUR gesamt"]
[{"$nulls":10},"Summe",{"$f":"SUM(L33:N38)","v":0},null,null,{"$f":"IF(L40-I40<          (IF((SUM(O33:Q39))>L40,L40,(SUM(O33:Q39)))), L40-I40,  (IF((SUM(O33:Q39))>L40,L40,(SUM(O33:Q39)))))","v":0},{"$nulls":4},"Summe",{"$f":"SUM(U33:W39)","v":0},null,null,{"$f":"O14+O27+O40","v":0}]
[]
["Kurzbeschreibung (Inhalt, Zielgruppe, Datum von-bis)"]
[]
["Die Beschreibung der Maßnahmen kann auch formlos auf einem extra Blatt erfolgen. Teilnahmelisten sind beizufügen!"]
["*TN: Teilnehmer/-innen"]

{"sheet":"BM I (5)","index":8,"n_rows":45,"n_cols":24,"rows_kept":45,"merged":[[0,13,0,16],[2,0,2,9],[2,14,2,16],[3,0,3,13],[5,0,6,0],[5,1,6,3],[5,6,6,7],[5,11,5,13],[5,14,5,16],[5,19,14,19],[6,11,6,13],[6,14,6,16],[7,0,11,0],[7,10,8,10],[7,11,8,13],[7,14,8,16],[8,1,9,4],[8,5,9,5],[8,6,9,8],[8,9,9,9],[9,10,10,10],[9,11,10,13],[9,14,10,16],[10,1,11,4],[10,5,11,5],[10,6,11,8],[10,9,11,9],[11,10,12,10],[11,11,12,13],[11,14,12,16],[12,0,14,5],[12,6,12,7],[12,8,12,9],[13,6,14,7],[13,8,14,9],[13,10,14,10],[13,11,14,13],[13,14,14,16],[15,0,15,16],[16,0,16,16],[18,0,19,0],[18,1,19,3],[18,6,19,7],[18,11,18,13],[18,14,18,16],[19,11,19,13],[19,14,19,16],[20,0,24,0],[20,10,21,10],[20,11,21,13],[20,14,21,16],[21,1,22,4],[21,5,22,5],[21,6,22,8],[21,9,22,9],[22,10,23,10],[22,11,23,13],[22,14,23,16],[23,1,24,4],[23,5,24,5],[23,6,24,8],[23,9,24,9],[24,10,25,10],[24,11,25,13],[24,14,25,16],[25,0,27,5],[25,6,25,7],[25,8,25,9],[26,6,27,7],[26,8,27,9],[26,10,27,10],[26,11,27,13],[26,14,27,16],[28,0,28,16],[29,0,29,16],[31,0,32,0],[31,1,32,3],[31,6,32,7],[31,11,31,13],[31,14,31,16],[31,20,31,22],[31,23,31,25],[32,11,32,13],[32,14,32,16],[32,20,32,22],[32,23,32,25],[33,0,37,0],[33,10,34,10],[33,11,34,13],[33,14,34,16],[33,19,34,19],[33,20,34,22],[33,23,34,25],[34,1,35,4],[34,5,35,5],[34,6,35,8],[34,9,35,9],[35,10,36,10],[35,11,36,13],[35,14,36,16],[35,19,36,19],[35,20,36,22],[35,23,36,25],[36,1,37,4],[36,5,37,5],[36,6,37,8],[36,9,37,9],[37,10,38,10],[37,11,38,13],[37,14,38,16],[37,19,38,19],[37,20,38,22],[37,23,38,25],[38,0,40,5],[38,6,38,7],[38,8,38,9],[39,6,40,7],[39,8,40,9],[39,10,40,10],[39,11,40,13],[39,14,40,16],[39,19,40,19],[39,20,40,22],[39,23,40,25],[41,0,41,16],[42,0,42,16]]}
["Landeshauptstadt Dresden - Jugendamt",{"$nulls":8},{"$f":"Deckblatt!R1","v":"Verwendungsnachweis 2019/2020"},null,null,"AZ:",{"$f":"Deckblatt!K4","v":0}]
[]
["Bildungsmaßnahmen",{"$nulls":9},{"$f":"Deckblatt!P24","v":0},{"$nulls":3},"BM I - Blatt 5"]
["Seminare/Exkursionen mit mind. 6 Seminar-/Exkursionsstunden pro Tag"]
[]
["13.","Tage ohne                             Übernachtung:",null,null,"Tage","TN*","Tage mit                                        Übernachtung:",null,"Anzahl der Ü","TN*","Ausgaben ","in EUR",null,null,"max. möglicher Zuschuss",{"$nulls":4},"Besteht eine BM z.B. aus 2 Tagen mit je 6 Seminar-/Exkursionsstunden und einer Übernachtung, ist ein Tag ohne Übernachtung und ein Tag mit Übernachtung einzutragen."]
[{"$nulls":10},"Honorarkosten",{"$nulls":3},{"$f":"IF(((F9+F11+J9+J11)*25)>L7,L7,((F9+F11+J9+J11)*25))","v":0}]
["Referenten","Name, Vorname",{"$nulls":3},"Stunden","Name, Vorname",null,null,"Stunden","Fahrt-, Reise-,                     Transportkosten",{"$nulls":3},{"$f":"IF(E7+F7+I7+J7=0,0,L8*35/100)","v":0}]
[]
[{"$nulls":10},"Betreuerkosten",{"$nulls":3},{"$f":"IF((O12*12.5/100)<L10,(O12*12.5/100),L10)","v":0}]
[]
[{"$nulls":10},"weitere Ausgaben (z. B. f. Unterkunft, Programmkosten)",{"$nulls":3},{"$f":"(E7*F7*5)+(I7*J7*10)","v":0}]
["eingenommene Teilnahmebeiträge",{"$nulls":5},"EUR pro Person",null,"EUR gesamt"]
[{"$nulls":10},"Summe",{"$f":"SUM(L7:N12)","v":0},null,null,{"$f":"IF(L14-I14<          (IF((SUM(O7:Q13))>L14,L14,(SUM(O7:Q13)))), L14-I14,  (IF((SUM(O7:Q13))>L14,L14,(SUM(O7:Q13)))))","v":0}]
[]
["Kurzbeschreibung (Inhalt, Zielgruppe, Datum von-bis)"]
[{"$nulls":19},"Sie möchten Absätze im Eingabefeld einfügen? \n-> Alt+Enter"]
[]
["14.","Tage ohne                             Übernachtung:",null,null,"Tage","TN*","Tage mit                                        Übernachtung:",null,"Anzahl der Ü","TN*","Ausgaben ","in EUR",null,null,"max. möglicher Zuschuss"]
[{"$nulls":10},"Honorarkosten",{"$nulls":3},{"$f":"IF(((F22+F24+J22+J24)*25)>L20,L20,((F22+F24+J22+J24)*25))","v":0}]
["Referenten","Name, Vorname",{"$nulls":3},"Stunden","Name, Vorname",null,null,"Stunden","Fahrt-, Reise-,                     Transportkosten",{"$nulls":3},{"$f":"IF(E20+F20+I20+J20=0,0,L21*35/100)","v":0}]
[]
[{"$nulls":10},"Betreuungskosten",{"$nulls":3},{"$f":"IF((O25*12.5/100)<L23,(O25*12.5/100),L23)","v":0}]
[]
[{"$nulls":10},"weitere Ausgaben (z. B. f. Unterkunft, Programmkosten)",{"$nulls":3},{"$f":"(E20*F20*5)+(I20*J20*10)","v":0}]
["eingenommene Teilnahmebeiträge",{"$nulls":5},"EUR pro Person",null,"EUR gesamt"]
[{"$nulls":10},"Summe",{"$f":"SUM(L20:N25)","v":0},null,null,{"$f":"IF(L27-I27<          (IF((SUM(O20:Q26))>L27,L27,(SUM(O20:Q26)))), L27-I27,  (IF((SUM(O20:Q26))>L27,L27,(SUM(O20:Q26)))))","v":0}]
[]
["Kurzbeschreibung (Inhalt, Zielgruppe, Datum von-bis)"]
[]
[]
["15.","Tage ohne                             Übernachtung:",null,null,"Tage","TN*","Tage mit                                        Übernachtung:",null,"Anzahl der Ü","TN*","Ausgaben ","in EUR",null,null,"max. möglicher Zuschuss",{"$nulls":4},"Blattsummen","in EUR",null,null,"max. möglicher Zuschuss"]
[{"$nulls":10},"Honorarkosten",{"$nulls":3},{"$f":"IF(((F35+F37+J35+J37)*25)>L33,L33,((F35+F37+J35+J37)*25))","v":0},{"$nulls":4},"Honorarkosten",{"$f":"L7+L20+L33","v":{"v":0,"d":"0.00"}}]
["Referenten","Name, Vorname",{"$nulls":3},"Stunden","Name, Vorname",null,null,"Stunden","Fahrt-, Reise-,                     Transportkosten",{"$nulls":3},{"$f":"IF(E33+F33+I33+J33=0,0,L34*35/100)","v":0},{"$nulls":4},"Fahrt-, Reise-,                     Transportkosten",{"$f":"L8+L21+L34","v":{"v":0,"d":"0.00"}}]
[]
[{"$nulls":10},"Betreuerkosten",{"$nulls":3},{"$f":"IF((O38*12.5/100)<L36,(O38*12.5/100),L36)","v":0},{"$nulls":4},"Betreuungskosten",{"$f":"L10+L23+L36","v":{"v":0,"d":"0.00"}}]
[]
[{"$nulls":10},"weitere Ausgaben (z. B. f. Unterkunft, Programmkosten)",{"$nulls":3},{"$f":"(E33*F33*5)+(I33*J33*10)","v":0},{"$nulls":4},"weitere Ausgaben (z. B. f. Unterkunft, Programmkosten)",{"$f":"L12+L25+L38","v":{"v":0,"d":"0.00"}}]
["eingenommene Teilnahmebeiträge",{"$nulls":5},"EUR pro Person",null,"EUR gesamt"]
[{"$nulls":10},"Summe",{"$f":"SUM(L33:N38)","v":0},null,null,{"$f":"IF(L40-I40<          (IF((SUM(O33:Q39))>L40,L40,(SUM(O33:Q39)))), L40-I40,  (IF((SUM(O33:Q39))>L40,L40,(SUM(O33:Q39)))))","v":0},{"$nulls":4},"Summe",{"$f":"SUM(U33:W39)","v":0},null,null,{"$f":"O14+O27+O40","v":0}]
[]
["Kurzbeschreibung (Inhalt, Zielgruppe, Datum von-bis)"]
[]
["Die Beschreibung der Maßnahmen kann auch formlos auf einem extra Blatt erfolgen. Teilnahmelisten sind beizufügen!"]
["*TN: Teilnehmer/-innen"]

{"sheet":"BM I (6)","index":9,"n_rows":45,"n_cols":24,"rows_kept":45,"merged":[[0,13,0,16],[2,0,2,9],[2,14,2,16],[3,0,3,13],[5,0,6,0],[5,1,6,3],[5,6,6,7],[5,11,5,13],[5,14,5,16],[5,19,14,19],[6,11,6,13],[6,14,6,16],[7,0,11,0],[7,10,8,10],[7,11,8,13],[7,14,8,16],[8,1,9,4],[8,5,9,5],[8,6,9,8],[8,9,9,9],[9,10,10,10],[9,11,10,13],[9,14,10,16],[10,1,11,4],[10,5,11,5],[10,6,11,8],[10,9,11,9],[11,10,12,10],[11,11,12,13],[11,14,12,16],[12,0,14,5],[12,6,12,7],[12,8,12,9],[13,6,14,7],[13,8,14,9],[13,10,14,10],[13,11,14,13],[13,14,14,16],[15,0,15,16],[16,0,16,16],[18,0,19,0],[18,1,19,3],[18,6,19,7],[18,11,18,13],[18,14,18,16],[19,11,19,13],[19,14,19,16],[20,0,24,0],[20,10,21,10],[20,11,21,13],[20,14,21,16],[21,1,22,4],[21,5,22,5],[21,6,22,8],[21,9,22,9],[22,10,23,10],[22,11,23,13],[22,14,23,16],[23,1,24,4],[23,5,24,5],[23,6,24,8],[23,9,24,9],[24,10,25,10],[24,11,25,13],[24,14,25,16],[25,0,27,5],[25,6,25,7],[25,8,25,9],[26,6,27,7],[26,8,27,9],[26,10,27,10],[26,11,27,13],[26,14,27,16],[28,0,28,16],[29,0,29,16],[31,0,32,0],[31,1,32,3],[31,6,32,7],[31,11,31,13],[31,14,31,16],[31,20,31,22],[31,23,31,25],[32,11,32,13],[32,14,32,16],[32,20,32,22],[32,23,32,25],[33,0,37,0],[33,10,34,10],[33,11,34,13],[33,14,34,16],[33,19,34,19],[33,20,34,22],[33,23,34,25],[34,1,35,4],[34,5,35,5],[34,6,35,8],[34,9,35,9],[35,10,36,10],[35,11,36,13],[35,14,36,16],[35,19,36,19],[35,20,36,22],[35,23,36,25],[36,1,37,4],[36,5,37,5],[36,6,37,8],[36,9,37,9],[37,10,38,10],[37,11,38,13],[37,14,38,16],[37,19,38,19],[37,20,38,22],[37,23,38,25],[38,0,40,5],[38,6,38,7],[38,8,38,9],[39,6,40,7],[39,8,40,9],[39,10,40,10],[39,11,40,13],[39,14,40,16],[39,19,40,19],[39,20,40,22],[39,23,40,25],[41,0,41,16],[42,0,42,16]]}
["Landeshauptstadt Dresden - Jugendamt",{"$nulls":8},{"$f":"Deckblatt!R1","v":"Verwendungsnachweis 2019/2020"},null,null,"AZ:",{"$f":"Deckblatt!K4","v":0}]
[]
["Bildungsmaßnahmen",{"$nulls":9},{"$f":"Deckblatt!P24","v":0},{"$nulls":3},"BM I - Blatt 6"]
["Seminare/Exkursionen mit mind. 6 Seminar-/Exkursionsstunden pro Tag"]
[]
["16.","Tage ohne                             Übernachtung:",null,null,"Tage","TN*","Tage mit                                        Übernachtung:",null,"Anzahl der Ü","TN*","Ausgaben ","in EUR",null,null,"max. möglicher Zuschuss",{"$nulls":4},"Besteht eine BM z.B. aus 2 Tagen mit je 6 Seminar-/Exkursionsstunden und einer Übernachtung, ist ein Tag ohne Übernachtung und ein Tag mit Übernachtung einzutragen."]
[{"$nulls":10},"Honorarkosten",{"$nulls":3},{"$f":"IF(((F9+F11+J9+J11)*25)>L7,L7,((F9+F11+J9+J11)*25))","v":0}]
["Referenten","Name, Vorname",{"$nulls":3},"Stunden","Name, Vorname",null,null,"Stunden","Fahrt-, Reise-,                     Transportkosten",{"$nulls":3},{"$f":"IF(E7+F7+I7+J7=0,0,L8*35/100)","v":0}]
[]
[{"$nulls":10},"Betreuerkosten",{"$nulls":3},{"$f":"IF((O12*12.5/100)<L10,(O12*12.5/100),L10)","v":0}]
[]
[{"$nulls":10},"weitere Ausgaben (z. B. f. Unterkunft, Programmkosten)",{"$nulls":3},{"$f":"(E7*F7*5)+(I7*J7*10)","v":0}]
["eingenommene Teilnahmebeiträge",{"$nulls":5},"EUR pro Person",null,"EUR gesamt"]
[{"$nulls":10},"Summe",{"$f":"SUM(L7:N12)","v":0},null,null,{"$f":"IF(L14-I14<          (IF((SUM(O7:Q13))>L14,L14,(SUM(O7:Q13)))), L14-I14,  (IF((SUM(O7:Q13))>L14,L14,(SUM(O7:Q13)))))","v":0}]
[]
["Kurzbeschreibung (Inhalt, Zielgruppe, Datum von-bis)"]
[{"$nulls":19},"Sie möchten Absätze im Eingabefeld einfügen? \n-> Alt+Enter"]
[]
["17.","Tage ohne                             Übernachtung:",null,null,"Tage","TN*","Tage mit                                        Übernachtung:",null,"Anzahl der Ü","TN*","Ausgaben ","in EUR",null,null,"max. möglicher Zuschuss"]
[{"$nulls":10},"Honorarkosten",{"$nulls":3},{"$f":"IF(((F22+F24+J22+J24)*25)>L20,L20,((F22+F24+J22+J24)*25))","v":0}]
["Referenten","Name, Vorname",{"$nulls":3},"Stunden","Name, Vorname",null,null,"Stunden","Fahrt-, Reise-,                     Transportkosten",{"$nulls":3},{"$f":"IF(E20+F20+I20+J20=0,0,L21*35/100)","v":0}]
[]
[{"$nulls":10},"Betreuerkosten",{"$nulls":3},{"$f":"IF((O25*12.5/100)<L23,(O25*12.5/100),L23)","v":0}]
[]
[{"$nulls":10},"weitere Ausgaben (z. B. f. Unterkunft, Programmkosten)",{"$nulls":3},{"$f":"(E20*F20*5)+(I20*J20*10)","v":0}]
["eingenommene Teilnahmebeiträge",{"$nulls":5},"EUR pro Person",null,"EUR gesamt"]
[{"$nulls":10},"Summe",{"$f":"SUM(L20:N25)","v":0},null,null,{"$f":"IF(L27-I27<          (IF((SUM(O20:Q26))>L27,L27,(SUM(O20:Q26)))), L27-I27,  (IF((SUM(O20:Q26))>L27,L27,(SUM(O20:Q26)))))","v":0}]
[]
["Kurzbeschreibung (Inhalt, Zielgruppe, Datum von-bis)"]
[]
[]
["18.","Tage ohne                             Übernachtung:",null,null,"Tage","TN*","Tage mit                                        Übernachtung:",null,"Anzahl der Ü","TN*","Ausgaben ","in EUR",null,null,"max. möglicher Zuschuss",{"$nulls":4},"Blattsummen","in EUR",null,null,"max. möglicher Zuschuss"]
[{"$nulls":10},"Honorarkosten",{"$nulls":3},{"$f":"IF(((F35+F37+J35+J37)*25)>L33,L33,((F35+F37+J35+J37)*25))","v":0},{"$nulls":4},"Honorarkosten",{"$f":"L7+L20+L33","v":{"v":0,"d":"0.00"}}]
["Referenten","Name, Vorname",{"$nulls":3},"Stunden","Name, Vorname",null,null,"Stunden","Fahrt-, Reise-,                     Transportkosten",{"$nulls":3},{"$f":"IF(E33+F33+I33+J33=0,0,L34*35/100)","v":0},{"$nulls":4},"Fahrt-, Reise-,                     Transportkosten",{"$f":"L8+L21+L34","v":{"v":0,"d":"0.00"}}]
[]
[{"$nulls":10},"Betreuerkosten",{"$nulls":3},{"$f":"IF((O38*12.5/100)<L36,(O38*12.5/100),L36)","v":0},{"$nulls":4},"Betreuungskosten",{"$f":"L10+L23+L36","v":{"v":0,"d":"0.00"}}]
[]
[{"$nulls":10},"weitere Ausgaben (z. B. f. Unterkunft, Programmkosten)",{"$nulls":3},{"$f":"(E33*F33*5)+(I33*J33*10)","v":0},{"$nulls":4},"weitere Ausgaben (z. B. f. Unterkunft, Programmkosten)",{"$f":"L12+L25+L38","v":{"v":0,"d":"0.00"}}]
["eingenommene Teilnahmebeiträge",{"$nulls":5},"EUR pro Person",null,"EUR gesamt"]
[{"$nulls":10},"Summe",{"$f":"SUM(L33:N38)","v":0},null,null,{"$f":"IF(L40-I40<          (IF((SUM(O33:Q39))>L40,L40,(SUM(O33:Q39)))), L40-I40,  (IF((SUM(O33:Q39))>L40,L40,(SUM(O33:Q39)))))","v":0},{"$nulls":4},"Summe",{"$f":"SUM(U33:W39)","v":0},null,null,{"$f":"O14+O27+O40","v":0}]
[]
["Kurzbeschreibung (Inhalt, Zielgruppe, Datum von-bis)"]
[]
["Die Beschreibung der Maßnahmen kann auch formlos auf einem extra Blatt erfolgen. Teilnahmelisten sind beizufügen!"]
["*TN: Teilnehmer/-innen"]

{"sheet":"BM I (7)","index":10,"n_rows":45,"n_cols":24,"rows_kept":45,"merged":[[0,13,0,16],[2,0,2,9],[2,14,2,16],[3,0,3,13],[5,0,6,0],[5,1,6,3],[5,6,6,7],[5,11,5,13],[5,14,5,16],[5,19,14,19],[6,11,6,13],[6,14,6,16],[7,0,11,0],[7,10,8,10],[7,11,8,13],[7,14,8,16],[8,1,9,4],[8,5,9,5],[8,6,9,8],[8,9,9,9],[9,10,10,10],[9,11,10,13],[9,14,10,16],[10,1,11,4],[10,5,11,5],[10,6,11,8],[10,9,11,9],[11,10,12,10],[11,11,12,13],[11,14,12,16],[12,0,14,5],[12,6,12,7],[12,8,12,9],[13,6,14,7],[13,8,14,9],[13,10,14,10],[13,11,14,13],[13,14,14,16],[15,0,15,16],[16,0,16,16],[18,0,19,0],[18,1,19,3],[18,6,19,7],[18,11,18,13],[18,14,18,16],[19,11,19,13],[19,14,19,16],[20,0,24,0],[20,10,21,10],[20,11,21,13],[20,14,21,16],[21,1,22,4],[21,5,22,5],[21,6,22,8],[21,9,22,9],[22,10,23,10],[22,11,23,13],[22,14,23,16],[23,1,24,4],[23,5,24,5],[23,6,24,8],[23,9,24,9],[24,10,25,10],[24,11,25,13],[24,14,25,16],[25,0,27,5],[25,6,25,7],[25,8,25,9],[26,6,27,7],[26,8,27,9],[26,10,27,10],[26,11,27,13],[26,14,27,16],[28,0,28,16],[29,0,29,16],[31,0,32,0],[31,1,32,3],[31,6,32,7],[31,11,31,13],[31,14,31,16],[31,20,31,22],[31,23,31,25],[32,11,32,13],[32,14,32,16],[32,20,32,22],[32,23,32,25],[33,0,37,0],[33,10,34,10],[33,11,34,13],[33,14,34,16],[33,19,34,19],[33,20,34,22],[33,23,34,25],[34,1,35,4],[34,5,35,5],[34,6,35,8],[34,9,35,9],[35,10,36,10],[35,11,36,13],[35,14,36,16],[35,19,36,19],[35,20,36,22],[35,23,36,25],[36,1,37,4],[36,5,37,5],[36,6,37,8],[36,9,37,9],[37,10,38,10],[37,11,38,13],[37,14,38,16],[37,19,38,19],[37,20,38,22],[37,23,38,25],[38,0,40,5],[38,6,38,7],[38,8,38,9],[39,6,40,7],[39,8,40,9],[39,10,40,10],[39,11,40,13],[39,14,40,16],[39,19,40,19],[39,20,40,22],[39,23,40,25],[41,0,41,16],[42,0,42,16]]}
["Landeshauptstadt Dresden - Jugendamt",{"$nulls":8},{"$f":"Deckblatt!R1","v":"Verwendungsnachweis 2019/2020"},null,null,"AZ:",{"$f":"Deckblatt!K4","v":0}]
[]
["Bildungsmaßnahmen",{"$nulls":9},{"$f":"Deckblatt!P24","v":0},{"$nulls":3},"BM I - Blatt 7"]
["Seminare/Exkursionen mit mind. 6 Seminar-/Exkursionsstunden pro Tag"]
[]
["19.","Tage ohne                             Übernachtung:",null,null,"Tage","TN*","Tage mit                                        Übernachtung:",null,"Anzahl der Ü","TN*","Ausgaben ","in EUR",null,null,"max. möglicher Zuschuss",{"$nulls":4},"Besteht eine BM z.B. aus 2 Tagen mit je 6 Seminar-/Exkursionsstunden und einer Übernachtung, ist ein Tag ohne Übernachtung und ein Tag mit Übernachtung einzutragen."]
[{"$nulls":10},"Honorarkosten",{"$nulls":3},{"$f":"IF(((F9+F11+J9+J11)*25)>L7,L7,((F9+F11+J9+J11)*25))","v":0}]
["Referenten","Name, Vorname",{"$nulls":3},"Stunden","Name, Vorname",null,null,"Stunden","Fahrt-, Reise-,                     Transportkosten",{"$nulls":3},{"$f":"IF(E7+F7+I7+J7=0,0,L8*35/100)","v":0}]
[]
[{"$nulls":10},"Betreuerkosten",{"$nulls":3},{"$f":"IF((O12*12.5/100)<L10,(O12*12.5/100),L10)","v":0}]
[]
[{"$nulls":10},"weitere Ausgaben (z. B. f. Unterkunft, Programmkosten)",{"$nulls":3},{"$f":"(E7*F7*5)+(I7*J7*10)","v":0}]
["eingenommene Teilnahmebeiträge",{"$nulls":5},"EUR pro Person",null,"EUR gesamt"]
[{"$nulls":10},"Summe",{"$f":"SUM(L7:N12)","v":0},null,null,{"$f":"IF(L14-I14<          (IF((SUM(O7:Q13))>L14,L14,(SUM(O7:Q13)))), L14-I14,  (IF((SUM(O7:Q13))>L14,L14,(SUM(O7:Q13)))))","v":0}]
[]
["Kurzbeschreibung (Inhalt, Zielgruppe, Datum von-bis)"]
[{"$nulls":19},"Sie möchten Absätze im Eingabefeld einfügen? \n-> Alt+Enter"]
[]
["20.","Tage ohne                             Übernachtung:",null,null,"Tage","TN*","Tage mit                                        Übernachtung:",null,"Anzahl der Ü","TN*","Ausgaben ","in EUR",null,null,"max. möglicher Zuschuss"]
[{"$nulls":10},"Honorarkosten",{"$nulls":3},{"$f":"IF(((F22+F24+J22+J24)*25)>L20,L20,((F22+F24+J22+J24)*25))","v":0}]
["Referenten","Name, Vorname",{"$nulls":3},"Stunden","Name, Vorname",null,null,"Stunden","Fahrt-, Reise-,                     Transportkosten",{"$nulls":3},{"$f":"IF(E20+F20+I20+J20=0,0,L21*35/100)","v":0}]
[]
[{"$nulls":10},"Betreuerkosten",{"$nulls":3},{"$f":"IF((O25*12.5/100)<L23,(O25*12.5/100),L23)","v":0}]
[]
[{"$nulls":10},"weitere Ausgaben (z. B. f. Unterkunft, Programmkosten)",{"$nulls":3},{"$f":"(E20*F20*5)+(I20*J20*10)","v":0}]
["eingenommene Teilnahmebeiträge",{"$nulls":5},"EUR pro Person",null,"EUR gesamt"]
[{"$nulls":10},"Summe",{"$f":"SUM(L20:N25)","v":0},null,null,{"$f":"IF(L27-I27<          (IF((SUM(O20:Q26))>L27,L27,(SUM(O20:Q26)))), L27-I27,  (IF((SUM(O20:Q26))>L27,L27,(SUM(O20:Q26)))))","v":0}]
[]
["Kurzbeschreibung (Inhalt, Zielgruppe, Datum von-bis)"]
[]
[]
["21.","Tage ohne                             Übernachtung:",null,null,"Tage","TN*","Tage mit                                        Übernachtung:",null,"Anzahl der Ü","TN*","Ausgaben ","in EUR",null,null,"max. möglicher Zuschuss",{"$nulls":4},"Blattsummen","in EUR",null,null,"max. möglicher Zuschuss"]
[{"$nulls":10},"Honorarkosten",{"$nulls":3},{"$f":"IF(((F35+F37+J35+J37)*25)>L33,L33,((F35+F37+J35+J37)*25))","v":0},{"$nulls":4},"Honorarkosten",{"$f":"L7+L20+L33","v":{"v":0,"d":"0.00"}}]
["Referenten","Name, Vorname",{"$nulls":3},"Stunden","Name, Vorname",null,null,"Stunden","Fahrt-, Reise-,                     Transportkosten",{"$nulls":3},{"$f":"IF(E33+F33+I33+J33=0,0,L34*35/100)","v":0},{"$nulls":4},"Fahrt-, Reise-,                     Transportkosten",{"$f":"L8+L21+L34","v":{"v":0,"d":"0.00"}}]
[]
[{"$nulls":10},"Betreuerkosten",{"$nulls":3},{"$f":"IF((O38*12.5/100)<L36,(O38*12.5/100),L36)","v":0},{"$nulls":4},"Betreuungskosten",{"$f":"L10+L23+L36","v":{"v":0,"d":"0.00"}}]
[]
[{"$nulls":10},"weitere Ausgaben (z. B. f. Unterkunft, Programmkosten)",{"$nulls":3},{"$f":"(E33*F33*5)+(I33*J33*10)","v":0},{"$nulls":4},"weitere Ausgaben (z. B. f. Unterkunft, Programmkosten)",{"$f":"L12+L25+L38","v":{"v":0,"d":"0.00"}}]
["eingenommene Teilnahmebeiträge",{"$nulls":5},"EUR pro Person",null,"EUR gesamt"]
[{"$nulls":10},"Summe",{"$f":"SUM(L33:N38)","v":0},null,null,{"$f":"IF(L40-I40<          (IF((SUM(O33:Q39))>L40,L40,(SUM(O33:Q39)))), L40-I40,  (IF((SUM(O33:Q39))>L40,L40,(SUM(O33:Q39)))))","v":0},{"$nulls":4},"Summe",{"$f":"SUM(U33:W39)","v":0},null,null,{"$f":"O14+O27+O40","v":0}]
[]
["Kurzbeschreibung (Inhalt, Zielgruppe, Datum von-bis)"]
[]
["Die Beschreibung der Maßnahmen kann auch formlos auf einem extra Blatt erfolgen. Teilnahmelisten sind beizufügen!"]
["*TN: Teilnehmer/-innen"]

{"sheet":"BM I (8)","index":11,"n_rows":45,"n_cols":24,"rows_kept":45,"merged":[[0,13,0,16],[2,0,2,9],[2,14,2,16],[3,0,3,13],[5,0,6,0],[5,1,6,3],[5,6,6,7],[5,11,5,13],[5,14,5,16],[5,19,14,19],[6,11,6,13],[6,14,6,16],[7,0,11,0],[7,10,8,10],[7,11,8,13],[7,14,8,16],[8,1,9,4],[8,5,9,5],[8,6,9,8],[8,9,9,9],[9,10,10,10],[9,11,10,13],[9,14,10,16],[10,1,11,4],[10,5,11,5],[10,6,11,8],[10,9,11,9],[11,10,12,10],[11,11,12,13],[11,14,12,16],[12,0,14,5],[12,6,12,7],[12,8,12,9],[13,6,14,7],[13,8,14,9],[13,10,14,10],[13,11,14,13],[13,14,14,16],[15,0,15,16],[16,0,16,16],[18,0,19,0],[18,1,19,3],[18,6,19,7],[18,11,18,13],[18,14,18,16],[19,11,19,13],[19,14,19,16],[20,0,24,0],[20,10,21,10],[20,11,21,13],[20,14,21,16],[21,1,22,4],[21,5,22,5],[21,6,22,8],[21,9,22,9],[22,10,23,10],[22,11,23,13],[22,14,23,16],[23,1,24,4],[23,5,24,5],[23,6,24,8],[23,9,24,9],[24,10,25,10],[24,11,25,13],[24,14,25,16],[25,0,27,5],[25,6,25,7],[25,8,25,9],[26,6,27,7],[26,8,27,9],[26,10,27,10],[26,11,27,13],[26,14,27,16],[28,0,28,16],[29,0,29,16],[31,0,32,0],[31,1,32,3],[31,6,32,7],[31,11,31,13],[31,14,31,16],[31,20,31,22],[31,23,31,25],[32,11,32,13],[32,14,32,16],[32,20,32,22],[32,23,32,25],[33,0,37,0],[33,10,34,10],[33,11,34,13],[33,14,34,16],[33,19,34,19],[33,20,34,22],[33,23,34,25],[34,1,35,4],[34,5,35,5],[34,6,35,8],[34,9,35,9],[35,10,36,10],[35,11,36,13],[35,14,36,16],[35,19,36,19],[35,20,36,22],[35,23,36,25],[36,1,37,4],[36,5,37,5],[36,6,37,8],[36,9,37,9],[37,10,38,10],[37,11,38,13],[37,14,38,16],[37,19,38,19],[37,20,38,22],[37,23,38,25],[38,0,40,5],[38,6,38,7],[38,8,38,9],[39,6,40,7],[39,8,40,9],[39,10,40,10],[39,11,40,13],[39,14,40,16],[39,19,40,19],[39,20,40,22],[39,23,40,25],[41,0,41,16],[42,0,42,16]]}
["Landeshauptstadt Dresden - Jugendamt",{"$nulls":8},{"$f":"Deckblatt!R1","v":"Verwendungsnachweis 2019/2020"},null,null,"AZ:",{"$f":"Deckblatt!K4","v":0}]
[]
["Bildungsmaßnahmen",{"$nulls":9},{"$f":"Deckblatt!P24","v":0},{"$nulls":3},"BM I - Blatt 8"]
["Seminare/Exkursionen mit mind. 6 Seminar-/Exkursionsstunden pro Tag"]
[]
["22.","Tage ohne                             Übernachtung:",null,null,"Tage","TN*","Tage mit                                        Übernachtung:",null,"Anzahl der Ü","TN*","Ausgaben ","in EUR",null,null,"max. möglicher Zuschuss",{"$nulls":4},"Besteht eine BM z.B. aus 2 Tagen mit je 6 Seminar-/Exkursionsstunden und einer Übernachtung, ist ein Tag ohne Übernachtung und ein Tag mit Übernachtung einzutragen."]
[{"$nulls":10},"Honorarkosten",{"$nulls":3},{"$f":"IF(((F9+F11+J9+J11)*25)>L7,L7,((F9+F11+J9+J11)*25))","v":0}]
["Referenten","Name, Vorname",{"$nulls":3},"Stunden","Name, Vorname",null,null,"Stunden","Fahrt-, Reise-,                     Transportkosten",{"$nulls":3},{"$f":"IF(E7+F7+I7+J7=0,0,L8*35/100)","v":0}]
[]
[{"$nulls":10},"Betreuerkosten",{"$nulls":3},{"$f":"IF((O12*12.5/100)<L10,(O12*12.5/100),L10)","v":0}]
[]
[{"$nulls":10},"weitere Ausgaben (z. B. f. Unterkunft, Programmkosten)",{"$nulls":3},{"$f":"(E7*F7*5)+(I7*J7*10)","v":0}]
["eingenommene Teilnahmebeiträge",{"$nulls":5},"EUR pro Person",null,"EUR gesamt"]
[{"$nulls":10},"Summe",{"$f":"SUM(L7:N12)","v":0},null,null,{"$f":"IF(L14-I14<          (IF((SUM(O7:Q13))>L14,L14,(SUM(O7:Q13)))), L14-I14,  (IF((SUM(O7:Q13))>L14,L14,(SUM(O7:Q13)))))","v":0}]
[]
["Kurzbeschreibung (Inhalt, Zielgruppe, Datum von-bis)"]
[{"$nulls":19},"Sie möchten Absätze im Eingabefeld einfügen? \n-> Alt+Enter"]
[]
["23.","Tage ohne                             Übernachtung:",null,null,"Tage","TN*","Tage mit                                        Übernachtung:",null,"Anzahl der Ü","TN*","Ausgaben ","in EUR",null,null,"max. möglicher Zuschuss"]
[{"$nulls":10},"Honorarkosten",{"$nulls":3},{"$f":"IF(((F22+F24+J22+J24)*25)>L20,L20,((F22+F24+J22+J24)*25))","v":0}]
["Referenten","Name, Vorname",{"$nulls":3},"Stunden","Name, Vorname",null,null,"Stunden","Fahrt-, Reise-,                     Transportkosten",{"$nulls":3},{"$f":"IF(E20+F20+I20+J20=0,0,L21*35/100)","v":0}]
[]
[{"$nulls":10},"Betreuerkosten",{"$nulls":3},{"$f":"IF((O25*12.5/100)<L23,(O25*12.5/100),L23)","v":0}]
[]
[{"$nulls":10},"weitere Ausgaben (z. B. f. Unterkunft, Programmkosten)",{"$nulls":3},{"$f":"(E20*F20*5)+(I20*J20*10)","v":0}]
["eingenommene Teilnahmebeiträge",{"$nulls":5},"EUR pro Person",null,"EUR gesamt"]
[{"$nulls":10},"Summe",{"$f":"SUM(L20:N25)","v":0},null,null,{"$f":"IF(L27-I27<          (IF((SUM(O20:Q26))>L27,L27,(SUM(O20:Q26)))), L27-I27,  (IF((SUM(O20:Q26))>L27,L27,(SUM(O20:Q26)))))","v":0}]
[]
["Kurzbeschreibung (Inhalt, Zielgruppe, Datum von-bis)"]
[]
[]
["24.","Tage ohne                             Übernachtung:",null,null,"Tage","TN*","Tage mit                                        Übernachtung:",null,"Anzahl der Ü","TN*","Ausgaben ","in EUR",null,null,"max. möglicher Zuschuss",{"$nulls":4},"Blattsummen","in EUR",null,null,"max. möglicher Zuschuss"]
[{"$nulls":10},"Honorarkosten",{"$nulls":3},{"$f":"IF(((F35+F37+J35+J37)*25)>L33,L33,((F35+F37+J35+J37)*25))","v":0},{"$nulls":4},"Honorarkosten",{"$f":"L7+L20+L33","v":{"v":0,"d":"0.00"}}]
["Referenten","Name, Vorname",{"$nulls":3},"Stunden","Name, Vorname",null,null,"Stunden","Fahrt-, Reise-,                     Transportkosten",{"$nulls":3},{"$f":"IF(E33+F33+I33+J33=0,0,L34*35/100)","v":0},{"$nulls":4},"Fahrt-, Reise-,                     Transportkosten",{"$f":"L8+L21+L34","v":{"v":0,"d":"0.00"}}]
[]
[{"$nulls":10},"Betreuerkosten",{"$nulls":3},{"$f":"IF((O38*12.5/100)<L36,(O38*12.5/100),L36)","v":0},{"$nulls":4},"Betreuungskosten",{"$f":"L10+L23+L36","v":{"v":0,"d":"0.00"}}]
[]
[{"$nulls":10},"weitere Ausgaben (z. B. f. Unterkunft, Programmkosten)",{"$nulls":3},{"$f":"(E33*F33*5)+(I33*J33*10)","v":0},{"$nulls":4},"weitere Ausgaben (z. B. f. Unterkunft, Programmkosten)",{"$f":"L12+L25+L38","v":{"v":0,"d":"0.00"}}]
["eingenommene Teilnahmebeiträge",{"$nulls":5},"EUR pro Person",null,"EUR gesamt"]
[{"$nulls":10},"Summe",{"$f":"SUM(L33:N38)","v":0},null,null,{"$f":"IF(L40-I40<          (IF((SUM(O33:Q39))>L40,L40,(SUM(O33:Q39)))), L40-I40,  (IF((SUM(O33:Q39))>L40,L40,(SUM(O33:Q39)))))","v":0},{"$nulls":4},"Summe",{"$f":"SUM(U33:W39)","v":0},null,null,{"$f":"O14+O27+O40","v":0}]
[]
["Kurzbeschreibung (Inhalt, Zielgruppe, Datum von-bis)"]
[]
["Die Beschreibung der Maßnahmen kann auch formlos auf einem extra Blatt erfolgen. Teilnahmelisten sind beizufügen!"]
["*TN: Teilnehmer/-innen"]

{"sheet":"BM II (1)","index":12,"n_rows":57,"n_cols":28,"rows_kept":57,"merged":[[2,0,2,11],[2,12,2,13],[2,16,2,18],[3,0,3,15],[5,0,7,0],[5,1,6,16],[5,17,5,18],[6,17,7,18],[6,20,7,22],[8,0,14,0],[8,1,8,7],[8,8,8,9],[8,10,10,12],[8,13,10,15],[8,16,10,18],[9,1,10,7],[9,8,10,9],[11,1,12,7],[11,8,12,9],[11,10,12,12],[11,13,12,15],[11,16,12,18],[13,1,14,7],[13,8,14,9],[13,10,14,12],[13,13,14,15],[13,16,14,18],[15,0,16,4],[15,5,15,6],[15,7,15,9],[15,10,16,12],[15,13,16,15],[15,16,16,18],[16,5,16,6],[16,7,16,9],[18,0,20,0],[18,1,19,16],[18,17,18,18],[19,17,20,18],[21,0,27,0],[21,1,21,7],[21,8,21,9],[21,10,23,12],[21,13,23,15],[21,16,23,18],[22,1,23,7],[22,8,23,9],[24,1,25,7],[24,8,25,9],[24,10,25,12],[24,13,25,15],[24,16,25,18],[26,1,27,7],[26,8,27,9],[26,10,27,12],[26,13,27,15],[26,16,27,18],[28,0,29,4],[28,5,28,6],[28,7,28,9],[28,10,29,12],[28,13,29,15],[28,16,29,18],[29,5,29,6],[29,7,29,9],[31,0,33,0],[31,1,32,16],[31,17,31,18],[32,17,33,18],[34,0,40,0],[34,1,34,7],[34,8,34,9],[34,10,36,12],[34,13,36,15],[34,16,36,18],[35,1,36,7],[35,8,36,9],[37,1,38,7],[37,8,38,9],[37,10,38,12],[37,13,38,15],[37,16,38,18],[39,1,40,7],[39,8,40,9],[39,10,40,12],[39,13,40,15],[39,16,40,18],[41,0,42,4],[41,5,41,6],[41,7,41,9],[41,10,42,12],[41,13,42,15],[41,16,42,18],[42,5,42,6],[42,7,42,9],[44,0,46,0],[44,1,45,16],[44,17,44,18],[45,17,46,18],[45,21,47,23],[45,24,47,26],[45,27,47,29],[47,0,53,0],[47,1,47,7],[47,8,47,9],[47,10,49,12],[47,13,49,15],[47,16,49,18],[48,1,49,7],[48,8,49,9],[48,21,49,23],[48,24,49,26],[48,27,49,29],[50,1,51,7],[50,8,51,9],[50,10,51,12],[50,13,51,15],[50,16,51,18],[50,21,51,23],[50,24,51,26],[50,27,51,29],[52,1,53,7],[52,8,53,9],[52,10,53,12],[52,13,53,15],[52,16,53,18],[52,21,53,23],[52,24,53,26],[52,27,53,29],[54,0,55,4],[54,5,54,6],[54,7,54,9],[54,10,55,12],[54,13,55,15],[54,16,55,18],[54,21,55,23],[54,24,55,26],[54,27,55,29],[55,5,55,6],[55,7,55,9]]}
["Landeshauptstadt Dresden - Jugendamt",{"$nulls":9},{"$f":"Deckblatt!R1","v":"Verwendungsnachweis 2019/2020"},{"$nulls":4},"AZ:",null,null,{"$f":"Deckblatt!K4","v":0}]
[]
["Bildungsmaßnahmen",{"$nulls":11},{"$f":"Deckblatt!P24","v":0},{"$nulls":3},"BM II - Blatt 1"]
["Kurzseminare mit mind. 3 Seminarstunden am Tag"]
[]
["1.",{"$nulls":19},"Sie möchten einen Absatz im Eingabefeld einfügen? "]
[{"$nulls":17},"Anzahl gleicher Seminare",null,null,"-> Alt+Enter"]
[null,"Kurzbeschreibung (Inhalt, Zielgruppe, Datum)"]
["Referenten","Name, Vorname",{"$nulls":6},"Stunden",null,"Ausgaben ",null,null,"in EUR",null,null,"max. möglicher Zuschuss"]
[]
[]
[{"$nulls":10},"Honorarkosten",{"$nulls":5},{"$f":"IF(((I10+I12+I14)*25)>N12,N12,((I10+I12+I14)*25))","v":0}]
[]
[{"$nulls":10},"weitere Ausgaben",{"$nulls":5},{"$f":"R6*50","v":0}]
[]
["eingenommene Teilnahmebeiträge",{"$nulls":4},"EUR pro Person:",null,"EUR gesamt:",null,null,"Summe",null,null,{"$f":"SUM(N12:P15)","v":0},null,null,{"$f":"IF(N16-H17<(IF((SUM(Q12:S15))>N16,N16,(SUM(Q12:S15)))),N16-H17,(IF((SUM(Q12:S15))>N16,N16,(SUM(Q12:S15)))))","v":0}]
[]
[]
["2."]
[{"$nulls":17},"Anzahl gleicher Seminare"]
[null,"Kurzbeschreibung (Inhalt, Zielgruppe, Datum)"]
["Referenten","Name, Vorname",{"$nulls":6},"Stunden",null,"Ausgaben ",null,null,"in EUR",null,null,"max. möglicher Zuschuss"]
[]
[]
[{"$nulls":10},"Honorarkosten",{"$nulls":5},{"$f":"IF(((I23+I25+I27)*25)>N25,N25,((I23+I25+I27)*25))","v":0}]
[]
[{"$nulls":10},"weitere Ausgaben",{"$nulls":5},{"$f":"R19*50","v":0}]
[]
["eingenommene Teilnahmebeiträge",{"$nulls":4},"EUR pro Person:",null,"EUR gesamt:",null,null,"Summe",null,null,{"$f":"SUM(N25:P28)","v":0},null,null,{"$f":"IF(N29-H30<(IF((SUM(Q25:S28))>N29,N29,(SUM(Q25:S28)))),N29-H30,(IF((SUM(Q25:S28))>N29,N29,(SUM(Q25:S28)))))","v":0}]
[]
[]
["3."]
[{"$nulls":17},"Anzahl gleicher Seminare"]
[null,"Kurzbeschreibung (Inhalt, Zielgruppe, Datum)"]
["Referenten","Name, Vorname",{"$nulls":6},"Stunden",null,"Ausgaben ",null,null,"in EUR",null,null,"max. möglicher Zuschuss"]
[]
[]
[{"$nulls":10},"Honorarkosten",{"$nulls":5},{"$f":"IF(((I36+I38+I40)*25)>N38,N38,((I36+I38+I40)*25))","v":0}]
[]
[{"$nulls":10},"weitere Ausgaben",{"$nulls":5},{"$f":"R32*50","v":0}]
[]
["eingenommene Teilnahmebeiträge",{"$nulls":4},"EUR pro Person:",null,"EUR gesamt:",null,null,"Summe",null,null,{"$f":"SUM(N38:P41)","v":0},null,null,{"$f":"IF(N42-H43<(IF((SUM(Q38:S41))>N42,N42,(SUM(Q38:S41)))),N42-H43,(IF((SUM(Q38:S41))>N42,N42,(SUM(Q38:S41)))))","v":0}]
[]
[]
["4."]
[{"$nulls":17},"Anzahl gleicher Seminare",{"$nulls":3},"Blattsummen",null,null,"in EUR",null,null,"max. möglicher Zuschuss"]
[null,"Kurzbeschreibung (Inhalt, Zielgruppe, Datum)"]
["Referenten","Name, Vorname",{"$nulls":6},"Stunden",null,"Ausgaben ",null,null,"in EUR",null,null,"max. möglicher Zuschuss"]
[{"$nulls":21},"Honorarkosten",null,null,{"$f":"N12+N25+N38+N51","v":{"v":0,"d":"0.00"}}]
[]
[{"$nulls":10},"Honorarkosten",{"$nulls":5},{"$f":"IF(((I49+I51+I53)*25)>N51,N51,((I49+I51+I53)*25))","v":0},{"$nulls":4},"weitere Ausgaben",null,null,{"$f":"N14+N27+N40+N53","v":{"v":0,"d":"0.00"}}]
[]
[{"$nulls":10},"weitere Ausgaben",{"$nulls":5},{"$f":"R45*50","v":0},{"$nulls":4},"Summe",null,null,{"$f":"SUM(Y49:AA52)","v":{"v":0,"d":"0.00"}},null,null,{"$f":"Q16+Q29+Q42+Q55","v":{"v":0,"d":"0.00"}}]
[]
["eingenommene Teilnahmebeiträge",{"$nulls":4},"EUR pro Person:",null,"EUR gesamt:",null,null,"Summe",null,null,{"$f":"SUM(N51:P54)","v":0},null,null,{"$f":"IF(N55-H56<(IF((SUM(Q51:S54))>N55,N55,(SUM(Q51:S54)))),N55-H56,(IF((SUM(Q51:S54))>N55,N55,(SUM(Q51:S54)))))","v":0},{"$nulls":4},"Summe BM II",null,null,{"$f":"Y53+'BM II (2)'!Y55+'BM II (3)'!Y55+'BM II (4)'!Y55","v":{"v":0,"d":"0.00"}},null,null,{"$f":"'BM II (1)'!AB53+'BM II (2)'!AB55+'BM II (3)'!AB55+'BM II (4)'!AB55","v":{"v":0,"d":"0.00"}}]
[]
["Die Beschreibung der Maßnahmen kann auch formlos auf einem extra Blatt erfolgen. Teilnahmelisten sind beizufügen!"]

{"sheet":"BM II (2)","index":13,"n_rows":57,"n_cols":28,"rows_kept":57,"merged":[[2,0,2,11],[2,12,2,13],[2,16,2,18],[3,0,3,15],[5,0,7,0],[5,1,6,16],[5,17,5,18],[6,17,7,18],[6,20,7,22],[8,0,14,0],[8,1,8,7],[8,8,8,9],[8,10,10,12],[8,13,10,15],[8,16,10,18],[9,1,10,7],[9,8,10,9],[11,1,12,7],[11,8,12,9],[11,10,12,12],[11,13,12,15],[11,16,12,18],[13,1,14,7],[13,8,14,9],[13,10,14,12],[13,13,14,15],[13,16,14,18],[15,0,16,4],[15,5,15,6],[15,7,15,9],[15,10,16,12],[15,13,16,15],[15,16,16,18],[16,5,16,6],[16,7,16,9],[18,0,20,0],[18,1,19,16],[18,17,18,18],[19,17,20,18],[21,0,27,0],[21,1,21,7],[21,8,21,9],[21,10,23,12],[21,13,23,15],[21,16,23,18],[22,1,23,7],[22,8,23,9],[24,1,25,7],[24,8,25,9],[24,10,25,12],[24,13,25,15],[24,16,25,18],[26,1,27,7],[26,8,27,9],[26,10,27,12],[26,13,27,15],[26,16,27,18],[28,0,29,4],[28,5,28,6],[28,7,28,9],[28,10,29,12],[28,13,29,15],[28,16,29,18],[29,5,29,6],[29,7,29,9],[31,0,33,0],[31,1,32,16],[31,17,31,18],[32,17,33,18],[34,0,40,0],[34,1,34,7],[34,8,34,9],[34,10,36,12],[34,13,36,15],[34,16,36,18],[35,1,36,7],[35,8,36,9],[37,1,38,7],[37,8,38,9],[37,10,38,12],[37,13,38,15],[37,16,38,18],[39,1,40,7],[39,8,40,9],[39,10,40,12],[39,13,40,15],[39,16,40,18],[41,0,42,4],[41,5,41,6],[41,7,41,9],[41,10,42,12],[41,13,42,15],[41,16,42,18],[42,5,42,6],[42,7,42,9],[44,0,46,0],[44,1,45,16],[44,17,44,18],[45,17,46,18],[47,0,53,0],[47,1,47,7],[47,8,47,9],[47,10,49,12],[47,13,49,15],[47,16,49,18],[47,21,49,23],[47,24,49,26],[47,27,49,29],[48,1,49,7],[48,8,49,9],[50,1,51,7],[50,8,51,9],[50,10,51,12],[50,13,51,15],[50,16,51,18],[50,21,51,23],[50,24,51,26],[50,27,51,29],[52,1,53,7],[52,8,53,9],[52,10,53,12],[52,13,53,15],[52,16,53,18],[52,21,53,23],[52,24,53,26],[52,27,53,29],[54,0,55,4],[54,5,54,6],[54,7,54,9],[54,10,55,12],[54,13,55,15],[54,16,55,18],[54,21,55,23],[54,24,55,26],[54,27,55,29],[55,5,55,6],[55,7,55,9]]}
["Landeshauptstadt Dresden - Jugendamt",{"$nulls":9},{"$f":"Deckblatt!R1","v":"Verwendungsnachweis 2019/2020"},{"$nulls":4},"AZ:",null,null,{"$f":"Deckblatt!K4","v":0}]
[]
["Bildungsmaßnahmen",{"$nulls":11},{"$f":"Deckblatt!P24","v":0},{"$nulls":3},"BM II - Blatt 2"]
["Kurzseminare mit mind. 3 Seminarstunden am Tag"]
[]
["5.",{"$nulls":19},"Sie möchten einen Absatz im Eingabefeld einfügen? "]
[{"$nulls":17},"Anzahl gleicher Seminare",null,null,"-> Alt+Enter"]
[null,"Kurzbeschreibung (Inhalt, Zielgruppe, Datum)"]
["Referenten","Name, Vorname",{"$nulls":6},"Stunden",null,"Ausgaben ",null,null,"in EUR",null,null,"max. möglicher Zuschuss"]
[]
[]
[{"$nulls":10},"Honorarkosten",{"$nulls":5},{"$f":"IF(((I10+I12+I14)*25)>N12,N12,((I10+I12+I14)*25))","v":0}]
[]
[{"$nulls":10},"weitere Ausgaben",{"$nulls":5},{"$f":"R6*50","v":0}]
[]
["eingenommene Teilnahmebeiträge",{"$nulls":4},"EUR pro Person:",null,"EUR gesamt:",null,null,"Summe",null,null,{"$f":"SUM(N12:P15)","v":0},null,null,{"$f":"IF(N16-H17<(IF((SUM(Q12:S15))>N16,N16,(SUM(Q12:S15)))),N16-H17,(IF((SUM(Q12:S15))>N16,N16,(SUM(Q12:S15)))))","v":0}]
[]
[]
["6."]
[{"$nulls":17},"Anzahl gleicher Seminare"]
[null,"Kurzbeschreibung (Inhalt, Zielgruppe, Datum)"]
["Referenten","Name, Vorname",{"$nulls":6},"Stunden",null,"Ausgaben ",null,null,"in EUR",null,null,"max. möglicher Zuschuss"]
[]
[]
[{"$nulls":10},"Honorarkosten",{"$nulls":5},{"$f":"IF(((I23+I25+I27)*25)>N25,N25,((I23+I25+I27)*25))","v":0}]
[]
[{"$nulls":10},"weitere Ausgaben",{"$nulls":5},{"$f":"R19*50","v":0}]
[]
["eingenommene Teilnahmebeiträge",{"$nulls":4},"EUR pro Person:",null,"EUR gesamt:",null,null,"Summe",null,null,{"$f":"SUM(N25:P28)","v":0},null,null,{"$f":"IF(N29-H30<(IF((SUM(Q25:S28))>N29,N29,(SUM(Q25:S28)))),N29-H30,(IF((SUM(Q25:S28))>N29,N29,(SUM(Q25:S28)))))","v":0}]
[]
[]
["7."]
[{"$nulls":17},"Anzahl gleicher Seminare"]
[null,"Kurzbeschreibung (Inhalt, Zielgruppe, Datum)"]
["Referenten","Name, Vorname",{"$nulls":6},"Stunden",null,"Ausgaben ",null,null,"in EUR",null,null,"max. möglicher Zuschuss"]
[]
[]
[{"$nulls":10},"Honorarkosten",{"$nulls":5},{"$f":"IF(((I36+I38+I40)*25)>N38,N38,((I36+I38+I40)*25))","v":0}]
[]
[{"$nulls":10},"weitere Ausgaben",{"$nulls":5},{"$f":"R32*50","v":0}]
[]
["eingenommene Teilnahmebeiträge",{"$nulls":4},"EUR pro Person:",null,"EUR gesamt:",null,null,"Summe",null,null,{"$f":"SUM(N38:P41)","v":0},null,null,{"$f":"IF(N42-H43<(IF((SUM(Q38:S41))>N42,N42,(SUM(Q38:S41)))),N42-H43,(IF((SUM(Q38:S41))>N42,N42,(SUM(Q38:S41)))))","v":0}]
[]
[]
["8."]
[{"$nulls":17},"Anzahl gleicher Seminare"]
[null,"Kurzbeschreibung (Inhalt, Zielgruppe, Datum)"]
["Referenten","Name, Vorname",{"$nulls":6},"Stunden",null,"Ausgaben ",null,null,"in EUR",null,null,"max. möglicher Zuschuss",{"$nulls":4},"Blattsummen",null,null,"in EUR",null,null,"max. möglicher Zuschuss"]
[]
[]
[{"$nulls":10},"Honorarkosten",{"$nulls":5},{"$f":"IF(((I49+I51+I53)*25)>N51,N51,((I49+I51+I53)*25))","v":0},{"$nulls":4},"Honorarkosten",null,null,{"$f":"N12+N25+N38+N51","v":{"v":0,"d":"0.00"}}]
[]
[{"$nulls":10},"weitere Ausgaben",{"$nulls":5},{"$f":"R45*50","v":0},{"$nulls":4},"weitere Ausgaben",null,null,{"$f":"N14+N27+N40+N53","v":{"v":0,"d":"0.00"}}]
[]
["eingenommene Teilnahmebeiträge",{"$nulls":4},"EUR pro Person:",null,"EUR gesamt:",null,null,"Summe",null,null,{"$f":"SUM(N51:P54)","v":0},null,null,{"$f":"IF(N55-H56<(IF((SUM(Q51:S54))>N55,N55,(SUM(Q51:S54)))),N55-H56,(IF((SUM(Q51:S54))>N55,N55,(SUM(Q51:S54)))))","v":0},{"$nulls":4},"Summe",null,null,{"$f":"SUM(Y51:AA54)","v":{"v":0,"d":"0.00"}},null,null,{"$f":"Q16+Q29+Q42+Q55","v":{"v":0,"d":"0.00"}}]
[]
["Die Beschreibung der Maßnahmen kann auch formlos auf einem extra Blatt erfolgen. Teilnahmelisten sind beizufügen!"]

{"sheet":"BM II (3)","index":14,"n_rows":57,"n_cols":28,"rows_kept":57,"merged":[[2,0,2,11],[2,12,2,13],[2,16,2,18],[3,0,3,15],[5,0,7,0],[5,1,6,16],[5,17,5,18],[6,17,7,18],[6,20,7,22],[8,0,14,0],[8,1,8,7],[8,8,8,9],[8,10,10,12],[8,13,10,15],[8,16,10,18],[9,1,10,7],[9,8,10,9],[11,1,12,7],[11,8,12,9],[11,10,12,12],[11,13,12,15],[11,16,12,18],[13,1,14,7],[13,8,14,9],[13,10,14,12],[13,13,14,15],[13,16,14,18],[15,0,16,4],[15,5,15,6],[15,7,15,9],[15,10,16,12],[15,13,16,15],[15,16,16,18],[16,5,16,6],[16,7,16,9],[18,0,20,0],[18,1,19,16],[18,17,18,18],[19,17,20,18],[21,0,27,0],[21,1,21,7],[21,8,21,9],[21,10,23,12],[21,13,23,15],[21,16,23,18],[22,1,23,7],[22,8,23,9],[24,1,25,7],[24,8,25,9],[24,10,25,12],[24,13,25,15],[24,16,25,18],[26,1,27,7],[26,8,27,9],[26,10,27,12],[26,13,27,15],[26,16,27,18],[28,0,29,4],[28,5,28,6],[28,7,28,9],[28,10,29,12],[28,13,29,15],[28,16,29,18],[29,5,29,6],[29,7,29,9],[31,0,33,0],[31,1,32,16],[31,17,31,18],[32,17,33,18],[34,0,40,0],[34,1,34,7],[34,8,34,9],[34,10,36,12],[34,13,36,15],[34,16,36,18],[35,1,36,7],[35,8,36,9],[37,1,38,7],[37,8,38,9],[37,10,38,12],[37,13,38,15],[37,16,38,18],[39,1,40,7],[39,8,40,9],[39,10,40,12],[39,13,40,15],[39,16,40,18],[41,0,42,4],[41,5,41,6],[41,7,41,9],[41,10,42,12],[41,13,42,15],[41,16,42,18],[42,5,42,6],[42,7,42,9],[44,0,46,0],[44,1,45,16],[44,17,44,18],[45,17,46,18],[47,0,53,0],[47,1,47,7],[47,8,47,9],[47,10,49,12],[47,13,49,15],[47,16,49,18],[47,21,49,23],[47,24,49,26],[47,27,49,29],[48,1,49,7],[48,8,49,9],[50,1,51,7],[50,8,51,9],[50,10,51,12],[50,13,51,15],[50,16,51,18],[50,21,51,23],[50,24,51,26],[50,27,51,29],[52,1,53,7],[52,8,53,9],[52,10,53,12],[52,13,53,15],[52,16,53,18],[52,21,53,23],[52,24,53,26],[52,27,53,29],[54,0,55,4],[54,5,54,6],[54,7,54,9],[54,10,55,12],[54,13,55,15],[54,16,55,18],[54,21,55,23],[54,24,55,26],[54,27,55,29],[55,5,55,6],[55,7,55,9]]}
["Landeshauptstadt Dresden - Jugendamt",{"$nulls":9},{"$f":"Deckblatt!R1","v":"Verwendungsnachweis 2019/2020"},{"$nulls":4},"AZ:",null,null,{"$f":"Deckblatt!K4","v":0}]
[]
["Bildungsmaßnahmen",{"$nulls":11},{"$f":"Deckblatt!P24","v":0},{"$nulls":3},"BM II - Blatt 3"]
["Kurzseminare mit mind. 3 Seminarstunden am Tag"]
[]
["9.",{"$nulls":19},"Sie möchten einen Absatz im Eingabefeld einfügen? "]
[{"$nulls":17},"Anzahl gleicher Seminare",null,null,"-> Alt+Enter"]
[null,"Kurzbeschreibung (Inhalt, Zielgruppe, Datum)"]
["Referenten","Name, Vorname",{"$nulls":6},"Stunden",null,"Ausgaben ",null,null,"in EUR",null,null,"max. möglicher Zuschuss"]
[]
[]
[{"$nulls":10},"Honorarkosten",{"$nulls":5},{"$f":"IF(((I10+I12+I14)*25)>N12,N12,((I10+I12+I14)*25))","v":0}]
[]
[{"$nulls":10},"weitere Ausgaben",{"$nulls":5},{"$f":"R6*50","v":0}]
[]
["eingenommene Teilnahmebeiträge",{"$nulls":4},"EUR pro Person:",null,"EUR gesamt:",null,null,"Summe",null,null,{"$f":"SUM(N12:P15)","v":0},null,null,{"$f":"IF(N16-H17<(IF((SUM(Q12:S15))>N16,N16,(SUM(Q12:S15)))),N16-H17,(IF((SUM(Q12:S15))>N16,N16,(SUM(Q12:S15)))))","v":0}]
[]
[]
["10."]
[{"$nulls":17},"Anzahl gleicher Seminare"]
[null,"Kurzbeschreibung (Inhalt, Zielgruppe, Datum)"]
["Referenten","Name, Vorname",{"$nulls":6},"Stunden",null,"Ausgaben ",null,null,"in EUR",null,null,"max. möglicher Zuschuss"]
[]
[]
[{"$nulls":10},"Honorarkosten",{"$nulls":5},{"$f":"IF(((I23+I25+I27)*25)>N25,N25,((I23+I25+I27)*25))","v":0}]
[]
[{"$nulls":10},"weitere Ausgaben",{"$nulls":5},{"$f":"R19*50","v":0}]
[]
["eingenommene Teilnahmebeiträge",{"$nulls":4},"EUR pro Person:",null,"EUR gesamt:",null,null,"Summe",null,null,{"$f":"SUM(N25:P28)","v":0},null,null,{"$f":"IF(N29-H30<(IF((SUM(Q25:S28))>N29,N29,(SUM(Q25:S28)))),N29-H30,(IF((SUM(Q25:S28))>N29,N29,(SUM(Q25:S28)))))","v":0}]
[]
[]
["11."]
[{"$nulls":17},"Anzahl gleicher Seminare"]
[null,"Kurzbeschreibung (Inhalt, Zielgruppe, Datum)"]
["Referenten","Name, Vorname",{"$nulls":6},"Stunden",null,"Ausgaben ",null,null,"in EUR",null,null,"max. möglicher Zuschuss"]
[]
[]
[{"$nulls":10},"Honorarkosten",{"$nulls":5},{"$f":"IF(((I36+I38+I40)*25)>N38,N38,((I36+I38+I40)*25))","v":0}]
[]
[{"$nulls":10},"weitere Ausgaben",{"$nulls":5},{"$f":"R32*50","v":0}]
[]
["eingenommene Teilnahmebeiträge",{"$nulls":4},"EUR pro Person:",null,"EUR gesamt:",null,null,"Summe",null,null,{"$f":"SUM(N38:P41)","v":0},null,null,{"$f":"IF(N42-H43<(IF((SUM(Q38:S41))>N42,N42,(SUM(Q38:S41)))),N42-H43,(IF((SUM(Q38:S41))>N42,N42,(SUM(Q38:S41)))))","v":0}]
[]
[]
["12."]
[{"$nulls":17},"Anzahl gleicher Seminare"]
[null,"Kurzbeschreibung (Inhalt, Zielgruppe, Datum)"]
["Referenten","Name, Vorname",{"$nulls":6},"Stunden",null,"Ausgaben ",null,null,"in EUR",null,null,"max. möglicher Zuschuss",{"$nulls":4},"Blattsummen",null,null,"in EUR",null,null,"max. möglicher Zuschuss"]
[]
[]
[{"$nulls":10},"Honorarkosten",{"$nulls":5},{"$f":"IF(((I49+I51+I53)*25)>N51,N51,((I49+I51+I53)*25))","v":0},{"$nulls":4},"Honorarkosten",null,null,{"$f":"N12+N25+N38+N51","v":{"v":0,"d":"0.00"}}]
[]
[{"$nulls":10},"weitere Ausgaben",{"$nulls":5},{"$f":"R45*50","v":0},{"$nulls":4},"weitere Ausgaben",null,null,{"$f":"N14+N27+N40+N53","v":{"v":0,"d":"0.00"}}]
[]
["eingenommene Teilnahmebeiträge",{"$nulls":4},"EUR pro Person:",null,"EUR gesamt:",null,null,"Summe",null,null,{"$f":"SUM(N51:P54)","v":0},null,null,{"$f":"IF(N55-H56<(IF((SUM(Q51:S54))>N55,N55,(SUM(Q51:S54)))),N55-H56,(IF((SUM(Q51:S54))>N55,N55,(SUM(Q51:S54)))))","v":0},{"$nulls":4},"Summe",null,null,{"$f":"SUM(Y51:AA54)","v":{"v":0,"d":"0.00"}},null,null,{"$f":"Q16+Q29+Q42+Q55","v":{"v":0,"d":"0.00"}}]
[]
["Die Beschreibung der Maßnahmen kann auch formlos auf einem extra Blatt erfolgen. Teilnahmelisten sind beizufügen!"]

{"sheet":"BM II (4)","index":15,"n_rows":57,"n_cols":28,"rows_kept":57,"merged":[[2,0,2,11],[2,12,2,13],[2,16,2,18],[3,0,3,15],[5,0,7,0],[5,1,6,16],[5,17,5,18],[6,17,7,18],[6,20,7,22],[8,0,14,0],[8,1,8,7],[8,8,8,9],[8,10,10,12],[8,13,10,15],[8,16,10,18],[9,1,10,7],[9,8,10,9],[11,1,12,7],[11,8,12,9],[11,10,12,12],[11,13,12,15],[11,16,12,18],[13,1,14,7],[13,8,14,9],[13,10,14,12],[13,13,14,15],[13,16,14,18],[15,0,16,4],[15,5,15,6],[15,7,15,9],[15,10,16,12],[15,13,16,15],[15,16,16,18],[16,5,16,6],[16,7,16,9],[18,0,20,0],[18,1,19,16],[18,17,18,18],[19,17,20,18],[21,0,27,0],[21,1,21,7],[21,8,21,9],[21,10,23,12],[21,13,23,15],[21,16,23,18],[22,1,23,7],[22,8,23,9],[24,1,25,7],[24,8,25,9],[24,10,25,12],[24,13,25,15],[24,16,25,18],[26,1,27,7],[26,8,27,9],[26,10,27,12],[26,13,27,15],[26,16,27,18],[28,0,29,4],[28,5,28,6],[28,7,28,9],[28,10,29,12],[28,13,29,15],[28,16,29,18],[29,5,29,6],[29,7,29,9],[31,0,33,0],[31,1,32,16],[31,17,31,18],[32,17,33,18],[34,0,40,0],[34,1,34,7],[34,8,34,9],[34,10,36,12],[34,13,36,15],[34,16,36,18],[35,1,36,7],[35,8,36,9],[37,1,38,7],[37,8,38,9],[37,10,38,12],[37,13,38,15],[37,16,38,18],[39,1,40,7],[39,8,40,9],[39,10,40,12],[39,13,40,15],[39,16,40,18],[41,0,42,4],[41,5,41,6],[41,7,41,9],[41,10,42,12],[41,13,42,15],[41,16,42,18],[42,5,42,6],[42,7,42,9],[44,0,46,0],[44,1,45,16],[44,17,44,18],[45,17,46,18],[47,0,53,0],[47,1,47,7],[47,8,47,9],[47,10,49,12],[47,13,49,15],[47,16,49,18],[47,21,49,23],[47,24,49,26],[47,27,49,29],[48,1,49,7],[48,8,49,9],[50,1,51,7],[50,8,51,9],[50,10,51,12],[50,13,51,15],[50,16,51,18],[50,21,51,23],[50,24,51,26],[50,27,51,29],[52,1,53,7],[52,8,53,9],[52,10,53,12],[52,13,53,15],[52,16,53,18],[52,21,53,23],[52,24,53,26],[52,27,53,29],[54,0,55,4],[54,5,54,6],[54,7,54,9],[54,10,55,12],[54,13,55,15],[54,16,55,18],[54,21,55,23],[54,24,55,26],[54,27,55,29],[55,5,55,6],[55,7,55,9]]}
["Landeshauptstadt Dresden - Jugendamt",{"$nulls":9},{"$f":"Deckblatt!R1","v":"Verwendungsnachweis 2019/2020"},{"$nulls":4},"AZ:",null,null,{"$f":"Deckblatt!K4","v":0}]
[]
["Bildungsmaßnahmen",{"$nulls":11},{"$f":"Deckblatt!P24","v":0},{"$nulls":3},"BM II - Blatt 4"]
["Kurzseminare mit mind. 3 Seminarstunden am Tag"]
[]
["13.",{"$nulls":19},"Sie möchten einen Absatz im Eingabefeld einfügen? "]
[{"$nulls":17},"Anzahl gleicher Seminare",null,null,"-> Alt+Enter"]
[null,"Kurzbeschreibung (Inhalt, Zielgruppe, Datum)"]
["Referenten","Name, Vorname",{"$nulls":6},"Stunden",null,"Ausgaben ",null,null,"in EUR",null,null,"max. möglicher Zuschuss"]
[{"$nulls":8},1]
[]
[{"$nulls":10},"Honorarkosten",{"$nulls":5},{"$f":"IF(((I10+I12+I14)*25)>N12,N12,((I10+I12+I14)*25))","v":0}]
[]
[{"$nulls":10},"weitere Ausgaben",{"$nulls":5},{"$f":"R6*50","v":0}]
[]
["eingenommene Teilnahmebeiträge",{"$nulls":4},"EUR pro Person:",null,"EUR gesamt:",null,null,"Summe",null,null,{"$f":"SUM(N12:P15)","v":0},null,null,{"$f":"IF(N16-H17<(IF((SUM(Q12:S15))>N16,N16,(SUM(Q12:S15)))),N16-H17,(IF((SUM(Q12:S15))>N16,N16,(SUM(Q12:S15)))))","v":0}]
[]
[]
["14."]
[{"$nulls":17},"Anzahl gleicher Seminare"]
[null,"Kurzbeschreibung (Inhalt, Zielgruppe, Datum)"]
["Referenten","Name, Vorname",{"$nulls":6},"Stunden",null,"Ausgaben ",null,null,"in EUR",null,null,"max. möglicher Zuschuss"]
[]
[]
[{"$nulls":10},"Honorarkosten",{"$nulls":5},{"$f":"IF(((I23+I25+I27)*25)>N25,N25,((I23+I25+I27)*25))","v":0}]
[]
[{"$nulls":10},"weitere Ausgaben",{"$nulls":5},{"$f":"R19*50","v":0}]
[]
["eingenommene Teilnahmebeiträge",{"$nulls":4},"EUR pro Person:",null,"EUR gesamt:",null,null,"Summe",null,null,{"$f":"SUM(N25:P28)","v":0},null,null,{"$f":"IF(N29-H30<(IF((SUM(Q25:S28))>N29,N29,(SUM(Q25:S28)))),N29-H30,(IF((SUM(Q25:S28))>N29,N29,(SUM(Q25:S28)))))","v":0}]
[]
[]
["15."]
[{"$nulls":17},"Anzahl gleicher Seminare"]
[null,"Kurzbeschreibung (Inhalt, Zielgruppe, Datum)"]
["Referenten","Name, Vorname",{"$nulls":6},"Stunden",null,"Ausgaben ",null,null,"in EUR",null,null,"max. möglicher Zuschuss"]
[]
[]
[{"$nulls":10},"Honorarkosten",{"$nulls":5},{"$f":"IF(((I36+I38+I40)*25)>N38,N38,((I36+I38+I40)*25))","v":0}]
[]
[{"$nulls":10},"weitere Ausgaben",{"$nulls":5},{"$f":"R32*50","v":0}]
[]
["eingenommene Teilnahmebeiträge",{"$nulls":4},"EUR pro Person:",null,"EUR gesamt:",null,null,"Summe",null,null,{"$f":"SUM(N38:P41)","v":0},null,null,{"$f":"IF(N42-H43<(IF((SUM(Q38:S41))>N42,N42,(SUM(Q38:S41)))),N42-H43,(IF((SUM(Q38:S41))>N42,N42,(SUM(Q38:S41)))))","v":0}]
[]
[]
["16."]
[{"$nulls":17},"Anzahl gleicher Seminare"]
[null,"Kurzbeschreibung (Inhalt, Zielgruppe, Datum)"]
["Referenten","Name, Vorname",{"$nulls":6},"Stunden",null,"Ausgaben ",null,null,"in EUR",null,null,"max. möglicher Zuschuss",{"$nulls":4},"Blattsummen",null,null,"in EUR",null,null,"max. möglicher Zuschuss"]
[]
[]
[{"$nulls":10},"Honorarkosten",{"$nulls":5},{"$f":"IF(((I49+I51+I53)*25)>N51,N51,((I49+I51+I53)*25))","v":0},{"$nulls":4},"Honorarkosten",null,null,{"$f":"N12+N25+N38+N51","v":{"v":0,"d":"0.00"}}]
[]
[{"$nulls":10},"weitere Ausgaben",{"$nulls":5},{"$f":"R45*50","v":0},{"$nulls":4},"weitere Ausgaben",null,null,{"$f":"N14+N27+N40+N53","v":{"v":0,"d":"0.00"}}]
[]
["eingenommene Teilnahmebeiträge",{"$nulls":4},"EUR pro Person:",null,"EUR gesamt:",null,null,"Summe",null,null,{"$f":"SUM(N51:P54)","v":0},null,null,{"$f":"IF(N55-H56<(IF((SUM(Q51:S54))>N55,N55,(SUM(Q51:S54)))),N55-H56,(IF((SUM(Q51:S54))>N55,N55,(SUM(Q51:S54)))))","v":0},{"$nulls":4},"Summe",null,null,{"$f":"SUM(Y51:AA54)","v":{"v":0,"d":"0.00"}},null,null,{"$f":"Q16+Q29+Q42+Q55","v":{"v":0,"d":"0.00"}}]
[]
["Die Beschreibung der Maßnahmen kann auch formlos auf einem extra Blatt erfolgen. Teilnahmelisten sind beizufügen!"]

{"sheet":"EPM (1)","index":16,"n_rows":45,"n_cols":23,"rows_kept":45,"merged":[[0,13,0,16],[2,0,2,9],[2,14,2,16],[4,0,5,0],[4,1,5,3],[4,6,5,7],[4,11,4,13],[4,14,4,16],[4,18,7,24],[5,11,5,13],[5,14,5,16],[6,0,7,5],[6,6,6,7],[6,8,6,9],[6,10,7,10],[6,11,7,13],[6,14,7,16],[7,6,7,7],[7,8,7,9],[8,10,9,10],[8,11,9,13],[8,14,9,16],[8,18,9,24],[9,0,10,9],[10,11,10,13],[10,14,10,16],[10,18,10,27],[12,0,13,0],[12,1,13,3],[12,6,13,7],[12,11,12,13],[12,14,12,16],[12,18,15,24],[13,11,13,13],[13,14,13,16],[14,0,15,5],[14,6,14,7],[14,8,14,9],[14,10,15,10],[14,11,15,13],[14,14,15,16],[15,6,15,7],[15,8,15,9],[16,10,17,10],[16,11,17,13],[16,14,17,16],[16,18,17,24],[17,0,18,9],[18,11,18,13],[18,14,18,16],[18,18,18,27],[20,0,21,0],[20,1,21,3],[20,6,21,7],[20,11,20,13],[20,14,20,16],[20,18,23,24],[21,11,21,13],[21,14,21,16],[22,0,23,5],[22,6,22,7],[22,8,22,9],[22,10,23,10],[22,11,23,13],[22,14,23,16],[23,6,23,7],[23,8,23,9],[24,10,25,10],[24,11,25,13],[24,14,25,16],[24,18,25,24],[25,0,26,9],[26,11,26,13],[26,14,26,16],[26,18,26,27],[28,0,29,0],[28,1,29,3],[28,6,29,7],[28,11,28,13],[28,14,28,16],[28,18,31,24],[29,11,29,13],[29,14,29,16],[30,0,31,5],[30,6,30,7],[30,8,30,9],[30,10,31,10],[30,11,31,13],[30,14,31,16],[31,6,31,7],[31,8,31,9],[32,10,33,10],[32,11,33,13],[32,14,33,16],[32,18,33,24],[33,0,34,9],[34,11,34,13],[34,14,34,16],[34,18,34,27],[36,0,37,0],[36,1,37,3],[36,6,37,7],[36,11,36,13],[36,14,36,16],[36,19,36,21],[36,22,36,24],[37,11,37,13],[37,14,37,16],[37,19,37,21],[37,22,37,24],[38,0,39,5],[38,6,38,7],[38,8,38,9],[38,10,39,10],[38,11,39,13],[38,14,39,16],[38,18,39,18],[38,19,39,21],[38,22,39,24],[39,6,39,7],[39,8,39,9],[40,10,41,10],[40,11,41,13],[40,14,41,16],[40,18,41,18],[40,19,41,21],[40,22,41,24],[41,0,42,9],[42,11,42,13],[42,14,42,16],[42,19,42,21],[42,22,42,24],[43,0,43,9],[43,10,43,16],[43,19,43,21],[43,22,43,24],[44,0,44,9],[44,10,44,16]]}
["Landeshauptstadt Dresden - Jugendamt",{"$nulls":8},{"$f":"Deckblatt!R1","v":"Verwendungsnachweis 2019/2020"},null,null,"AZ:",{"$f":"Deckblatt!K4","v":0}]
[]
["Erlebnispädagogische Maßnahmen",{"$nulls":9},{"$f":"Deckblatt!P24","v":0},{"$nulls":3},"EPM - Blatt 1"]
[]
["1.","Tage ohne                             Übernachtung:",null,null,"Tage","TN*","Tage mit                                        Übernachtung:",null,"Anzahl der Ü","TN*","Ausgaben ","in EUR",null,null,"max. möglicher Zuschuss",{"$nulls":3},"Ein Maßnahmetag + 1 Nacht wird als eine Übernachtung gezählt. Es werden bis zu 10 EUR/TN gewährt. Beginnt jedoch z. B. eine Maßnahme bereits früh und endet an einem anderen Tag abends, dann kann 1 Tag + 1 Übernachtung je TN geltend gemacht werden (= 15 EUR). "]
[{"$nulls":10},"Fahrt-, Reise-,                     Transportkosten",{"$nulls":3},{"$f":"L6*35/100","v":0}]
["eingenommene Teilnahmebeiträge",{"$nulls":5},"EUR pro Person",null,"EUR gesamt",null,"Betreuerkosten",{"$nulls":3},{"$f":"IF((((E6*F6*5)+(I6*J6*10))*20/100)>L7,L7,(((E6*F6*5)+(I6*J6*10))*20/100))","v":0}]
[]
["Kurzbeschreibung (Inhalt, Zielgruppe, Datum von-bis)",{"$nulls":9},"weitere Ausgaben (z. B. f. Unterkunft, Programmkosten)",{"$nulls":3},{"$f":"(E6*F6*5)+(I6*J6*10)","v":0},{"$nulls":3},{"$f":"IF(E6+I6>4,\"Die Maßnahme ist nicht zuwendungsfähig, da sie die Höchstdauer von 4 Tagen überschreitet.\",\"\")","v":""}]
[]
[{"$nulls":10},"Summe",{"$f":"SUM(L6:N9)","v":0},null,null,{"$f":"IF(E6+I6>4,0,(IF(J6+F6<5,0,(IF(L11-I8<(IF(L11<(SUM(O6:Q9)),L11,(SUM(O6:Q9)))),L11-I8, (IF(L11<(SUM(O6:Q9)),L11,(SUM(O6:Q9)))))))))","v":0},{"$nulls":3},{"$f":"IF(F6+J6<5,\"Die Maßnahme ist nicht zuwendungsfähig, da die Mindestteilnehmerzahl von 5 jungen Menschen nicht erbracht wird.\",\"\")","v":"Die Maßnahme ist nicht zuwendungsfähig, da die Mindestteilnehmerzahl von 5 jungen Menschen nicht erbracht wird."}]
[]
["2.","Tage ohne                             Übernachtung:",null,null,"Tage","TN*","Tage mit                                        Übernachtung:",null,"Anzahl der Ü","TN*","Ausgaben ","in EUR",null,null,"max. möglicher Zuschuss"]
[{"$nulls":10},"Fahrt-, Reise-,                     Transportkosten",{"$nulls":3},{"$f":"L14*35/100","v":0}]
["eingenommene Teilnahmebeiträge",{"$nulls":5},"EUR pro Person",null,"EUR gesamt",null,"Betreuerkosten",{"$nulls":3},{"$f":"IF((((E14*F14*5)+(I14*J14*10))*20/100)>L15,L15,(((E14*F14*5)+(I14*J14*10))*20/100))","v":0}]
[]
["Kurzbeschreibung (Inhalt, Zielgruppe, Datum von-bis)",{"$nulls":9},"weitere Ausgaben (z. B. f. Unterkunft, Programmkosten)",{"$nulls":3},{"$f":"(E14*F14*5)+(I14*J14*10)","v":0},{"$nulls":3},{"$f":"IF(E14+I14>4,\"Die Maßnahme ist nicht zuwendungsfähig, da sie die Höchstdauer von 4 Tagen überschreitet.\",\"\")","v":""}]
[]
[{"$nulls":10},"Summe",{"$f":"SUM(L14:N17)","v":0},null,null,{"$f":"IF(E14+I14>4,0,(IF(J14+F14<5,0,(IF(L19-I16<(IF(L19<(SUM(O14:Q17)),L19,(SUM(O14:Q17)))),L19-I16, (IF(L19<(SUM(O14:Q17)),L19,(SUM(O14:Q17)))))))))","v":0},{"$nulls":3},{"$f":"IF(F14=0,(IF(F14+J14<5,\"Die Maßnahme ist nicht zuwendungsfähig, da die Mindestteilnehmerzahl von 5 jungen Menschen nicht erfüllt wird.\",\"\")),\"\")","v":"Die Maßnahme ist nicht zuwendungsfähig, da die Mindestteilnehmerzahl von 5 jungen Menschen nicht erfüllt wird."}]
[]
["3.","Tage ohne                             Übernachtung:",null,null,"Tage","TN*","Tage mit                                        Übernachtung:",null,"Anzahl der Ü","TN*","Ausgaben ","in EUR",null,null,"max. möglicher Zuschuss"]
[{"$nulls":10},"Fahrt-, Reise-,                     Transportkosten",{"$nulls":3},{"$f":"L22*35/100","v":0}]
["eingenommene Teilnahmebeiträge",{"$nulls":5},"EUR pro Person",null,"EUR gesamt",null,"Betreuerkosten",{"$nulls":3},{"$f":"IF((((E22*F22*5)+(I22*J22*10))*20/100)>L23,L23,(((E22*F22*5)+(I22*J22*10))*20/100))","v":0}]
[]
["Kurzbeschreibung (Inhalt, Zielgruppe, Datum von-bis)",{"$nulls":9},"weitere Ausgaben (z. B. f. Unterkunft, Programmkosten)",{"$nulls":3},{"$f":"(E22*F22*5)+(I22*J22*10)","v":0},{"$nulls":3},{"$f":"IF(E22+I22>4,\"Die Maßnahme ist nicht zuwendungsfähig, da sie die Höchstdauer von 4 Tagen überschreitet.\",\"\")","v":""}]
[]
[{"$nulls":10},"Summe",{"$f":"SUM(L22:N25)","v":0},null,null,{"$f":"IF(E22+I22>4,0,(IF(J22+F22<5,0,(IF(L27-I24<(IF(L27<(SUM(O22:Q25)),L27,(SUM(O22:Q25)))),L27-I24, (IF(L27<(SUM(O22:Q25)),L27,(SUM(O22:Q25)))))))))","v":0}]
[]
["4.","Tage ohne                             Übernachtung:",null,null,"Tage","TN*","Tage mit                                        Übernachtung:",null,"Anzahl der Ü","TN*","Ausgaben ","in EUR",null,null,"max. möglicher Zuschuss"]
[{"$nulls":10},"Fahrt-, Reise-,                     Transportkosten",{"$nulls":3},{"$f":"L30*35/100","v":0}]
["eingenommene Teilnahmebeiträge",{"$nulls":5},"EUR pro Person",null,"EUR gesamt",null,"Betreuerkosten",{"$nulls":3},{"$f":"IF((((E30*F30*5)+(I30*J30*10))*20/100)>L31,L31,(((E30*F30*5)+(I30*J30*10))*20/100))","v":0}]
[]
["Kurzbeschreibung (Inhalt, Zielgruppe, Datum von-bis)",{"$nulls":9},"weitere Ausgaben (z. B. f. Unterkunft, Programmkosten)",{"$nulls":3},{"$f":"(E30*F30*5)+(I30*J30*10)","v":0},{"$nulls":3},{"$f":"IF(E30+I30>4,\"Die Maßnahme ist nicht zuwendungsfähig, da sie die Höchstdauer von 4 Tagen überschreitet.\",\"\")","v":""}]
[]
[{"$nulls":10},"Summe",{"$f":"SUM(L30:N33)","v":0},null,null,{"$f":"IF(E30+I30>4,0,(IF(J30+F30<5,0,(IF(L35-I32<(IF(L35<(SUM(O30:Q33)),L35,(SUM(O30:Q33)))),L35-I32, (IF(L35<(SUM(O30:Q33)),L35,(SUM(O30:Q33)))))))))","v":0},{"$nulls":3},{"$f":"IF(F30+J30<5,\"Die Maßnahme ist nicht zuwendungsfähig, da die Mindestteilnehmerzahl von 5 jungen Menschen nicht erbracht wird.\",\"\")","v":"Die Maßnahme ist nicht zuwendungsfähig, da die Mindestteilnehmerzahl von 5 jungen Menschen nicht erbracht wird."}]
[]
["5.","Tage ohne                             Übernachtung:",null,null,"Tage","TN*","Tage mit                                        Übernachtung:",null,"Anzahl der Ü","TN*","Ausgaben ","in EUR",null,null,"max. möglicher Zuschuss",{"$nulls":3},"Blattsummen","in EUR",null,null,"max. möglicher Zuschuss"]
[{"$nulls":10},"Fahrt-, Reise-,                     Transportkosten",{"$nulls":3},{"$f":"L38*35/100","v":0},{"$nulls":3},"Fahrt-, Reise-,                     Transportkosten",{"$f":"L6+L14+L22+L30+L38","v":{"v":0,"d":"0.00"}}]
["eingenommene Teilnahmebeiträge",{"$nulls":5},"EUR pro Person",null,"EUR gesamt",null,"Betreuerkosten",{"$nulls":3},{"$f":"IF((((E38*F38*5)+(I38*J38*10))*20/100)>L39,L39,(((E38*F38*5)+(I38*J38*10))*20/100))","v":0},{"$nulls":3},"Betreuungskosten",{"$f":"L7+L15+L23+L31+L39","v":{"v":0,"d":"0.00"}}]
[]
["Kurzbeschreibung (Inhalt, Zielgruppe, Datum von-bis)",{"$nulls":9},"weitere Ausgaben (z. B. f. Unterkunft, Programmkosten)",{"$nulls":3},{"$f":"(E38*F38*5)+(I38*J38*10)","v":0},{"$nulls":3},"weitere Ausgaben (z. B. f. Unterkunft, Programmkosten)",{"$f":"L9+L17+L25+L33+L41","v":{"v":0,"d":"0.00"}}]
[]
[{"$nulls":10},"Summe",{"$f":"SUM(L38:N41)","v":0},null,null,{"$f":"IF(E38+I38>4,0,(IF(J38+F38<5,0,(IF(L43-I40<(IF(L43<(SUM(O38:Q41)),L43,(SUM(O38:Q41)))),L43-I40, (IF(L43<(SUM(O38:Q41)),L43,(SUM(O38:Q41)))))))))","v":0},{"$nulls":3},"Summe",{"$f":"SUM(T38:V42)","v":0},null,null,{"$f":"O11+O19+O27+O35+O43","v":0}]
["*TN: Teilnehmer/-innen\nDie Beschreibung der Maßnahmen kann auch formlos auf einem extra Blatt erfolgen. Teilnahmelisten sind beizufügen!",{"$nulls":9},{"$f":"IF(E38+I38>4,\"Die Maßnahme ist nicht zuwendungsfähig, da sie die Höchstdauer von 4 Tagen überschreitet.\",\"\")","v":""},{"$nulls":7},"EPM gesamt",{"$f":"SUM('EPM (1):EPM (3)'!T43)","v":0},null,null,{"$f":"SUM('EPM (1):EPM (3)'!W43)","v":0}]
[{"$nulls":10},{"$f":"IF(F38+J38<5,\"Die Maßnahme ist nicht zuwendungsfähig, da die Mindestteilnehmerzahl von 5 jungen Menschen nicht erbracht wird.\",\"\")","v":"Die Maßnahme ist nicht zuwendungsfähig, da die Mindestteilnehmerzahl von 5 jungen Menschen nicht erbracht wird."}]

{"sheet":"EPM (2)","index":17,"n_rows":45,"n_cols":23,"rows_kept":45,"merged":[[0,13,0,16],[2,0,2,9],[2,14,2,16],[4,0,5,0],[4,1,5,3],[4,6,5,7],[4,11,4,13],[4,14,4,16],[4,18,7,24],[5,11,5,13],[5,14,5,16],[6,0,7,5],[6,6,6,7],[6,8,6,9],[6,10,7,10],[6,11,7,13],[6,14,7,16],[7,6,7,7],[7,8,7,9],[8,10,9,10],[8,11,9,13],[8,14,9,16],[8,18,9,24],[9,0,10,9],[10,11,10,13],[10,14,10,16],[10,18,10,27],[12,0,13,0],[12,1,13,3],[12,6,13,7],[12,11,12,13],[12,14,12,16],[12,18,15,24],[13,11,13,13],[13,14,13,16],[14,0,15,5],[14,6,14,7],[14,8,14,9],[14,10,15,10],[14,11,15,13],[14,14,15,16],[15,6,15,7],[15,8,15,9],[16,10,17,10],[16,11,17,13],[16,14,17,16],[16,18,17,24],[17,0,18,9],[18,11,18,13],[18,14,18,16],[18,18,18,27],[20,0,21,0],[20,1,21,3],[20,6,21,7],[20,11,20,13],[20,14,20,16],[20,18,23,24],[21,11,21,13],[21,14,21,16],[22,0,23,5],[22,6,22,7],[22,8,22,9],[22,10,23,10],[22,11,23,13],[22,14,23,16],[23,6,23,7],[23,8,23,9],[24,10,25,10],[24,11,25,13],[24,14,25,16],[24,18,25,24],[25,0,26,9],[26,11,26,13],[26,14,26,16],[26,18,26,27],[28,0,29,0],[28,1,29,3],[28,6,29,7],[28,11,28,13],[28,14,28,16],[28,18,31,24],[29,11,29,13],[29,14,29,16],[30,0,31,5],[30,6,30,7],[30,8,30,9],[30,10,31,10],[30,11,31,13],[30,14,31,16],[31,6,31,7],[31,8,31,9],[32,10,33,10],[32,11,33,13],[32,14,33,16],[32,18,33,24],[33,0,34,9],[34,11,34,13],[34,14,34,16],[34,18,34,27],[36,0,37,0],[36,1,37,3],[36,6,37,7],[36,11,36,13],[36,14,36,16],[36,19,36,21],[36,22,36,24],[37,11,37,13],[37,14,37,16],[37,19,37,21],[37,22,37,24],[38,0,39,5],[38,6,38,7],[38,8,38,9],[38,10,39,10],[38,11,39,13],[38,14,39,16],[38,18,39,18],[38,19,39,21],[38,22,39,24],[39,6,39,7],[39,8,39,9],[40,10,41,10],[40,11,41,13],[40,14,41,16],[40,18,41,18],[40,19,41,21],[40,22,41,24],[41,0,42,9],[42,11,42,13],[42,14,42,16],[42,19,42,21],[42,22,42,24],[43,0,43,9],[43,10,43,16],[44,0,44,9],[44,10,44,16]]}
["Landeshauptstadt Dresden - Jugendamt",{"$nulls":8},{"$f":"Deckblatt!R1","v":"Verwendungsnachweis 2019/2020"},null,null,"AZ:",{"$f":"Deckblatt!K4","v":0}]
[]
["Erlebnispädagogische Maßnahmen",{"$nulls":9},{"$f":"Deckblatt!P24","v":0},{"$nulls":3},"EPM - Blatt 2"]
[]
["6.","Tage ohne                             Übernachtung:",null,null,"Tage","TN*","Tage mit                                        Übernachtung:",null,"Anzahl der Ü","TN*","Ausgaben ","in EUR",null,null,"max. möglicher Zuschuss",{"$nulls":3},"Ein Maßnahmetag + 1 Nacht wird als eine Übernachtung gezählt. Es werden bis zu 10 EUR/TN gewährt. Beginnt jedoch z. B. eine Maßnahme bereits früh und endet an einem anderen Tag abends, dann kann 1 Tag + 1 Übernachtung je TN geltend gemacht werden (= 15 EUR). "]
[{"$nulls":10},"Fahrt-, Reise-,                     Transportkosten",{"$nulls":3},{"$f":"L6*35/100","v":0}]
["eingenommene Teilnahmebeiträge",{"$nulls":5},"EUR pro Person",null,"EUR gesamt",null,"Betreuerkosten",{"$nulls":3},{"$f":"IF((((E6*F6*5)+(I6*J6*10))*20/100)>L7,L7,(((E6*F6*5)+(I6*J6*10))*20/100))","v":0}]
[]
["Kurzbeschreibung (Inhalt, Zielgruppe, Datum von-bis)",{"$nulls":9},"weitere Ausgaben (z. B. f. Unterkunft, Programmkosten)",{"$nulls":3},{"$f":"(E6*F6*5)+(I6*J6*10)","v":0},{"$nulls":3},{"$f":"IF(E6+I6>4,\"Die Maßnahme ist nicht zuwendungsfähig, da sie die Höchstdauer von 4 Tagen überschreitet.\",\"\")","v":""}]
[]
[{"$nulls":10},"Summe",{"$f":"SUM(L6:N9)","v":0},null,null,{"$f":"IF(E6+I6>4,0,(IF(J6+F6<5,0,(IF(L11-I8<(IF(L11<(SUM(O6:Q9)),L11,(SUM(O6:Q9)))),L11-I8, (IF(L11<(SUM(O6:Q9)),L11,(SUM(O6:Q9)))))))))","v":0},{"$nulls":3},{"$f":"IF(F6+J6<5,\"Die Maßnahme ist nicht zuwendungsfähig, da die Mindestteilnehmerzahl von 5 jungen Menschen nicht erbracht wird.\",\"\")","v":"Die Maßnahme ist nicht zuwendungsfähig, da die Mindestteilnehmerzahl von 5 jungen Menschen nicht erbracht wird."}]
[]
["7.","Tage ohne                             Übernachtung:",null,null,"Tage","TN*","Tage mit                                        Übernachtung:",null,"Anzahl der Ü","TN*","Ausgaben ","in EUR",null,null,"max. möglicher Zuschuss"]
[{"$nulls":10},"Fahrt-, Reise-,                     Transportkosten",{"$nulls":3},{"$f":"L14*35/100","v":0}]
["eingenommene Teilnahmebeiträge",{"$nulls":5},"EUR pro Person",null,"EUR gesamt",null,"Betreuerkosten",{"$nulls":3},{"$f":"IF((((E14*F14*5)+(I14*J14*10))*20/100)>L15,L15,(((E14*F14*5)+(I14*J14*10))*20/100))","v":0}]
[]
["Kurzbeschreibung (Inhalt, Zielgruppe, Datum von-bis)",{"$nulls":9},"weitere Ausgaben (z. B. f. Unterkunft, Programmkosten)",{"$nulls":3},{"$f":"(E14*F14*5)+(I14*J14*10)","v":0},{"$nulls":3},{"$f":"IF(E14+I14>4,\"Die Maßnahme ist nicht zuwendungsfähig, da sie die Höchstdauer von 4 Tagen überschreitet.\",\"\")","v":""}]
[]
[{"$nulls":10},"Summe",{"$f":"SUM(L14:N17)","v":0},null,null,{"$f":"IF(E14+I14>4,0,(IF(J14+F14<5,0,(IF(L19-I16<(IF(L19<(SUM(O14:Q17)),L19,(SUM(O14:Q17)))),L19-I16, (IF(L19<(SUM(O14:Q17)),L19,(SUM(O14:Q17)))))))))","v":0},{"$nulls":3},{"$f":"IF(F14=0,(IF(F14+J14<5,\"Die Maßnahme ist nicht zuwendungsfähig, da die Mindestteilnehmerzahl von 5 jungen Menschen nicht erfüllt wird.\",\"\")),\"\")","v":"Die Maßnahme ist nicht zuwendungsfähig, da die Mindestteilnehmerzahl von 5 jungen Menschen nicht erfüllt wird."}]
[]
["8.","Tage ohne                             Übernachtung:",null,null,"Tage","TN*","Tage mit                                        Übernachtung:",null,"Anzahl der Ü","TN*","Ausgaben ","in EUR",null,null,"max. möglicher Zuschuss"]
[{"$nulls":10},"Fahrt-, Reise-,                     Transportkosten",{"$nulls":3},{"$f":"L22*35/100","v":0}]
["eingenommene Teilnahmebeiträge",{"$nulls":5},"EUR pro Person",null,"EUR gesamt",null,"Betreuerkosten",{"$nulls":3},{"$f":"IF((((E22*F22*5)+(I22*J22*10))*20/100)>L23,L23,(((E22*F22*5)+(I22*J22*10))*20/100))","v":0}]
[]
["Kurzbeschreibung (Inhalt, Zielgruppe, Datum von-bis)",{"$nulls":9},"weitere Ausgaben (z. B. f. Unterkunft, Programmkosten)",{"$nulls":3},{"$f":"(E22*F22*5)+(I22*J22*10)","v":0},{"$nulls":3},{"$f":"IF(E22+I22>4,\"Die Maßnahme ist nicht zuwendungsfähig, da sie die Höchstdauer von 4 Tagen überschreitet.\",\"\")","v":""}]
[]
[{"$nulls":10},"Summe",{"$f":"SUM(L22:N25)","v":0},null,null,{"$f":"IF(E22+I22>4,0,(IF(J22+F22<5,0,(IF(L27-I24<(IF(L27<(SUM(O22:Q25)),L27,(SUM(O22:Q25)))),L27-I24, (IF(L27<(SUM(O22:Q25)),L27,(SUM(O22:Q25)))))))))","v":0}]
[]
["9.","Tage ohne                             Übernachtung:",null,null,"Tage","TN*","Tage mit                                        Übernachtung:",null,"Anzahl der Ü","TN*","Ausgaben ","in EUR",null,null,"max. möglicher Zuschuss"]
[{"$nulls":10},"Fahrt-, Reise-,                     Transportkosten",{"$nulls":3},{"$f":"L30*35/100","v":0}]
["eingenommene Teilnahmebeiträge",{"$nulls":5},"EUR pro Person",null,"EUR gesamt",null,"Betreuerkosten",{"$nulls":3},{"$f":"IF((((E30*F30*5)+(I30*J30*10))*20/100)>L31,L31,(((E30*F30*5)+(I30*J30*10))*20/100))","v":0}]
[]
["Kurzbeschreibung (Inhalt, Zielgruppe, Datum von-bis)",{"$nulls":9},"weitere Ausgaben (z. B. f. Unterkunft, Programmkosten)",{"$nulls":3},{"$f":"(E30*F30*5)+(I30*J30*10)","v":0},{"$nulls":3},{"$f":"IF(E30+I30>4,\"Die Maßnahme ist nicht zuwendungsfähig, da sie die Höchstdauer von 4 Tagen überschreitet.\",\"\")","v":""}]
[]
[{"$nulls":10},"Summe",{"$f":"SUM(L30:N33)","v":0},null,null,{"$f":"IF(E30+I30>4,0,(IF(J30+F30<5,0,(IF(L35-I32<(IF(L35<(SUM(O30:Q33)),L35,(SUM(O30:Q33)))),L35-I32, (IF(L35<(SUM(O30:Q33)),L35,(SUM(O30:Q33)))))))))","v":0},{"$nulls":3},{"$f":"IF(F30+J30<5,\"Die Maßnahme ist nicht zuwendungsfähig, da die Mindestteilnehmerzahl von 5 jungen Menschen nicht erbracht wird.\",\"\")","v":"Die Maßnahme ist nicht zuwendungsfähig, da die Mindestteilnehmerzahl von 5 jungen Menschen nicht erbracht wird."}]
[]
["10.","Tage ohne                             Übernachtung:",null,null,"Tage","TN*","Tage mit                                        Übernachtung:",null,"Anzahl der Ü","TN*","Ausgaben ","in EUR",null,null,"max. möglicher Zuschuss",{"$nulls":3},"Blattsummen","in EUR",null,null,"max. möglicher Zuschuss"]
[{"$nulls":10},"Fahrt-, Reise-,                     Transportkosten",{"$nulls":3},{"$f":"L38*35/100","v":0},{"$nulls":3},"Fahrt-, Reise-,                     Transportkosten",{"$f":"L6+L14+L22+L30+L38","v":{"v":0,"d":"0.00"}}]
["eingenommene Teilnahmebeiträge",{"$nulls":5},"EUR pro Person",null,"EUR gesamt",null,"Betreuerkosten",{"$nulls":3},{"$f":"IF((((E38*F38*5)+(I38*J38*10))*20/100)>L39,L39,(((E38*F38*5)+(I38*J38*10))*20/100))","v":0},{"$nulls":3},"Betreuerkosten",{"$f":"L7+L15+L23+L31+L39","v":{"v":0,"d":"0.00"}}]
[]
["Kurzbeschreibung (Inhalt, Zielgruppe, Datum von-bis)",{"$nulls":9},"weitere Ausgaben (z. B. f. Unterkunft, Programmkosten)",{"$nulls":3},{"$f":"(E38*F38*5)+(I38*J38*10)","v":0},{"$nulls":3},"weitere Ausgaben (z. B. f. Unterkunft, Programmkosten)",{"$f":"L9+L17+L25+L33+L41","v":{"v":0,"d":"0.00"}}]
[]
[{"$nulls":10},"Summe",{"$f":"SUM(L38:N41)","v":0},null,null,{"$f":"IF(E38+I38>4,0,(IF(J38+F38<5,0,(IF(L43-I40<(IF(L43<(SUM(O38:Q41)),L43,(SUM(O38:Q41)))),L43-I40, (IF(L43<(SUM(O38:Q41)),L43,(SUM(O38:Q41)))))))))","v":0},{"$nulls":3},"Summe",{"$f":"SUM(T38:V42)","v":0},null,null,{"$f":"O11+O19+O27+O35+O43","v":0}]
["*TN: Teilnehmer/-innen\nDie Beschreibung der Maßnahmen kann auch formlos auf einem extra Blatt erfolgen. Teilnahmelisten sind beizufügen!",{"$nulls":9},{"$f":"IF(E38+I38>4,\"Die Maßnahme ist nicht zuwendungsfähig, da sie die Höchstdauer von 4 Tagen überschreitet.\",\"\")","v":""}]
[{"$nulls":10},{"$f":"IF(F38+J38<5,\"Die Maßnahme ist nicht zuwendungsfähig, da die Mindestteilnehmerzahl von 5 jungen Menschen nicht erbracht wird.\",\"\")","v":"Die Maßnahme ist nicht zuwendungsfähig, da die Mindestteilnehmerzahl von 5 jungen Menschen nicht erbracht wird."}]

{"sheet":"EPM (3)","index":18,"n_rows":45,"n_cols":23,"rows_kept":45,"merged":[[0,13,0,16],[2,0,2,9],[2,14,2,16],[4,0,5,0],[4,1,5,3],[4,6,5,7],[4,11,4,13],[4,14,4,16],[4,18,7,24],[5,11,5,13],[5,14,5,16],[6,0,7,5],[6,6,6,7],[6,8,6,9],[6,10,7,10],[6,11,7,13],[6,14,7,16],[7,6,7,7],[7,8,7,9],[8,10,9,10],[8,11,9,13],[8,14,9,16],[8,18,9,24],[9,0,10,9],[10,11,10,13],[10,14,10,16],[10,18,10,27],[12,0,13,0],[12,1,13,3],[12,6,13,7],[12,11,12,13],[12,14,12,16],[12,18,15,24],[13,11,13,13],[13,14,13,16],[14,0,15,5],[14,6,14,7],[14,8,14,9],[14,10,15,10],[14,11,15,13],[14,14,15,16],[15,6,15,7],[15,8,15,9],[16,10,17,10],[16,11,17,13],[16,14,17,16],[16,18,17,24],[17,0,18,9],[18,11,18,13],[18,14,18,16],[18,18,18,27],[20,0,21,0],[20,1,21,3],[20,6,21,7],[20,11,20,13],[20,14,20,16],[20,18,23,24],[21,11,21,13],[21,14,21,16],[22,0,23,5],[22,6,22,7],[22,8,22,9],[22,10,23,10],[22,11,23,13],[22,14,23,16],[23,6,23,7],[23,8,23,9],[24,10,25,10],[24,11,25,13],[24,14,25,16],[24,18,25,24],[25,0,26,9],[26,11,26,13],[26,14,26,16],[26,18,26,27],[28,0,29,0],[28,1,29,3],[28,6,29,7],[28,11,28,13],[28,14,28,16],[28,18,31,24],[29,11,29,13],[29,14,29,16],[30,0,31,5],[30,6,30,7],[30,8,30,9],[30,10,31,10],[30,11,31,13],[30,14,31,16],[31,6,31,7],[31,8,31,9],[32,10,33,10],[32,11,33,13],[32,14,33,16],[32,18,33,24],[33,0,34,9],[34,11,34,13],[34,14,34,16],[34,18,34,27],[36,0,37,0],[36,1,37,3],[36,6,37,7],[36,11,36,13],[36,14,36,16],[36,19,36,21],[36,22,36,24],[37,11,37,13],[37,14,37,16],[37,19,37,21],[37,22,37,24],[38,0,39,5],[38,6,38,7],[38,8,38,9],[38,10,39,10],[38,11,39,13],[38,14,39,16],[38,18,39,18],[38,19,39,21],[38,22,39,24],[39,6,39,7],[39,8,39,9],[40,10,41,10],[40,11,41,13],[40,14,41,16],[40,18,41,18],[40,19,41,21],[40,22,41,24],[41,0,42,9],[42,11,42,13],[42,14,42,16],[42,19,42,21],[42,22,42,24],[43,0,43,9],[43,10,43,16],[44,0,44,9],[44,10,44,16]]}
["Landeshauptstadt Dresden - Jugendamt",{"$nulls":8},{"$f":"Deckblatt!R1","v":"Verwendungsnachweis 2019/2020"},null,null,"AZ:",{"$f":"Deckblatt!K4","v":0}]
[]
["Erlebnispädagogische Maßnahmen",{"$nulls":9},{"$f":"Deckblatt!P24","v":0},{"$nulls":3},"EPM - Blatt 3"]
[]
["11.","Tage ohne                             Übernachtung:",null,null,"Tage","TN*","Tage mit                                        Übernachtung:",null,"Anzahl der Ü","TN*","Ausgaben ","in EUR",null,null,"max. möglicher Zuschuss",{"$nulls":3},"Ein Maßnahmetag + 1 Nacht wird als eine Übernachtung gezählt. Es werden bis zu 10 EUR/TN gewährt. Beginnt jedoch z. B. eine Maßnahme bereits früh und endet an einem anderen Tag abends, dann kann 1 Tag + 1 Übernachtung je TN geltend gemacht werden (= 15 EUR). "]
[{"$nulls":10},"Fahrt-, Reise-,                     Transportkosten",{"$nulls":3},{"$f":"L6*35/100","v":0}]
["eingenommene Teilnahmebeiträge",{"$nulls":5},"EUR pro Person",null,"EUR gesamt",null,"Betreuerkosten",{"$nulls":3},{"$f":"IF((((E6*F6*5)+(I6*J6*10))*20/100)>L7,L7,(((E6*F6*5)+(I6*J6*10))*20/100))","v":0}]
[]
["Kurzbeschreibung (Inhalt, Zielgruppe, Datum von-bis)",{"$nulls":9},"weitere Ausgaben (z. B. f. Unterkunft, Programmkosten)",{"$nulls":3},{"$f":"(E6*F6*5)+(I6*J6*10)","v":0},{"$nulls":3},{"$f":"IF(E6+I6>4,\"Die Maßnahme ist nicht zuwendungsfähig, da sie die Höchstdauer von 4 Tagen überschreitet.\",\"\")","v":""}]
[]
[{"$nulls":10},"Summe",{"$f":"SUM(L6:N9)","v":0},null,null,{"$f":"IF(E6+I6>4,0,(IF(J6+F6<5,0,(IF(L11-I8<(IF(L11<(SUM(O6:Q9)),L11,(SUM(O6:Q9)))),L11-I8, (IF(L11<(SUM(O6:Q9)),L11,(SUM(O6:Q9)))))))))","v":0},{"$nulls":3},{"$f":"IF(F6+J6<5,\"Die Maßnahme ist nicht zuwendungsfähig, da die Mindestteilnehmerzahl von 5 jungen Menschen nicht erbracht wird.\",\"\")","v":"Die Maßnahme ist nicht zuwendungsfähig, da die Mindestteilnehmerzahl von 5 jungen Menschen nicht erbracht wird."}]
[]
["12.","Tage ohne                             Übernachtung:",null,null,"Tage","TN*","Tage mit                                        Übernachtung:",null,"Anzahl der Ü","TN*","Ausgaben ","in EUR",null,null,"max. möglicher Zuschuss"]
[{"$nulls":10},"Fahrt-, Reise-,                     Transportkosten",{"$nulls":3},{"$f":"L14*35/100","v":0}]
["eingenommene Teilnahmebeiträge",{"$nulls":5},"EUR pro Person",null,"EUR gesamt",null,"Betreuerkosten",{"$nulls":3},{"$f":"IF((((E14*F14*5)+(I14*J14*10))*20/100)>L15,L15,(((E14*F14*5)+(I14*J14*10))*20/100))","v":0}]
[]
["Kurzbeschreibung (Inhalt, Zielgruppe, Datum von-bis)",{"$nulls":9},"weitere Ausgaben (z. B. f. Unterkunft, Programmkosten)",{"$nulls":3},{"$f":"(E14*F14*5)+(I14*J14*10)","v":0},{"$nulls":3},{"$f":"IF(E14+I14>4,\"Die Maßnahme ist nicht zuwendungsfähig, da sie die Höchstdauer von 4 Tagen überschreitet.\",\"\")","v":""}]
[]
[{"$nulls":10},"Summe",{"$f":"SUM(L14:N17)","v":0},null,null,{"$f":"IF(E14+I14>4,0,(IF(J14+F14<5,0,(IF(L19-I16<(IF(L19<(SUM(O14:Q17)),L19,(SUM(O14:Q17)))),L19-I16, (IF(L19<(SUM(O14:Q17)),L19,(SUM(O14:Q17)))))))))","v":0},{"$nulls":3},{"$f":"IF(F14=0,(IF(F14+J14<5,\"Die Maßnahme ist nicht zuwendungsfähig, da die Mindestteilnehmerzahl von 5 jungen Menschen nicht erfüllt wird.\",\"\")),\"\")","v":"Die Maßnahme ist nicht zuwendungsfähig, da die Mindestteilnehmerzahl von 5 jungen Menschen nicht erfüllt wird."}]
[]
["13.","Tage ohne                             Übernachtung:",null,null,"Tage","TN*","Tage mit                                        Übernachtung:",null,"Anzahl der Ü","TN*","Ausgaben ","in EUR",null,null,"max. möglicher Zuschuss"]
[{"$nulls":10},"Fahrt-, Reise-,                     Transportkosten",{"$nulls":3},{"$f":"L22*35/100","v":0}]
["eingenommene Teilnahmebeiträge",{"$nulls":5},"EUR pro Person",null,"EUR gesamt",null,"Betreuerkosten",{"$nulls":3},{"$f":"IF((((E22*F22*5)+(I22*J22*10))*20/100)>L23,L23,(((E22*F22*5)+(I22*J22*10))*20/100))","v":0}]
[]
["Kurzbeschreibung (Inhalt, Zielgruppe, Datum von-bis)",{"$nulls":9},"weitere Ausgaben (z. B. f. Unterkunft, Programmkosten)",{"$nulls":3},{"$f":"(E22*F22*5)+(I22*J22*10)","v":0},{"$nulls":3}," "]
[]
[{"$nulls":10},"Summe",{"$f":"SUM(L22:N25)","v":0},null,null,{"$f":"IF(E22+I22>4,0,(IF(J22+F22<5,0,(IF(L27-I24<(IF(L27<(SUM(O22:Q25)),L27,(SUM(O22:Q25)))),L27-I24, (IF(L27<(SUM(O22:Q25)),L27,(SUM(O22:Q25)))))))))","v":0}]
[]
["14.","Tage ohne                             Übernachtung:",null,null,"Tage","TN*","Tage mit                                        Übernachtung:",null,"Anzahl der Ü","TN*","Ausgaben ","in EUR",null,null,"max. möglicher Zuschuss"]
[{"$nulls":10},"Fahrt-, Reise-,                     Transportkosten",{"$nulls":3},{"$f":"L30*35/100","v":0}]
["eingenommene Teilnahmebeiträge",{"$nulls":5},"EUR pro Person",null,"EUR gesamt",null,"Betreuerkosten",{"$nulls":3},{"$f":"IF((((E30*F30*5)+(I30*J30*10))*20/100)>L31,L31,(((E30*F30*5)+(I30*J30*10))*20/100))","v":0}]
[]
["Kurzbeschreibung (Inhalt, Zielgruppe, Datum von-bis)",{"$nulls":9},"weitere Ausgaben (z. B. f. Unterkunft, Programmkosten)",{"$nulls":3},{"$f":"(E30*F30*5)+(I30*J30*10)","v":0},{"$nulls":3},{"$f":"IF(E30+I30>4,\"Die Maßnahme ist nicht zuwendungsfähig, da sie die Höchstdauer von 4 Tagen überschreitet.\",\"\")","v":""}]
[]
[{"$nulls":10},"Summe",{"$f":"SUM(L30:N33)","v":0},null,null,{"$f":"IF(E30+I30>4,0,(IF(J30+F30<5,0,(IF(L35-I32<(IF(L35<(SUM(O30:Q33)),L35,(SUM(O30:Q33)))),L35-I32, (IF(L35<(SUM(O30:Q33)),L35,(SUM(O30:Q33)))))))))","v":0},{"$nulls":3},{"$f":"IF(F30+J30<5,\"Die Maßnahme ist nicht zuwendungsfähig, da die Mindestteilnehmerzahl von 5 jungen Menschen nicht erbracht wird.\",\"\")","v":"Die Maßnahme ist nicht zuwendungsfähig, da die Mindestteilnehmerzahl von 5 jungen Menschen nicht erbracht wird."}]
[]
["15.","Tage ohne                             Übernachtung:",null,null,"Tage","TN*","Tage mit                                        Übernachtung:",null,"Anzahl der Ü","TN*","Ausgaben ","in EUR",null,null,"max. möglicher Zuschuss",{"$nulls":3},"Blattsummen","in EUR",null,null,"max. möglicher Zuschuss"]
[{"$nulls":10},"Fahrt-, Reise-,                     Transportkosten",{"$nulls":3},{"$f":"L38*35/100","v":0},{"$nulls":3},"Fahrt-, Reise-,                     Transportkosten",{"$f":"L6+L14+L22+L30+L38","v":{"v":0,"d":"0.00"}}]
["eingenommene Teilnahmebeiträge",{"$nulls":5},"EUR pro Person",null,"EUR gesamt",null,"Betreuerkosten",{"$nulls":3},{"$f":"IF((((E38*F38*5)+(I38*J38*10))*20/100)>L39,L39,(((E38*F38*5)+(I38*J38*10))*20/100))","v":0},{"$nulls":3},"Betreuerkosten",{"$f":"L7+L15+L23+L31+L39","v":{"v":0,"d":"0.00"}}]
[]
["Kurzbeschreibung (Inhalt, Zielgruppe, Datum von-bis)",{"$nulls":9},"weitere Ausgaben (z. B. f. Unterkunft, Programmkosten)",{"$nulls":3},{"$f":"(E38*F38*5)+(I38*J38*10)","v":0},{"$nulls":3},"weitere Ausgaben (z. B. f. Unterkunft, Programmkosten)",{"$f":"L9+L17+L25+L33+L41","v":{"v":0,"d":"0.00"}}]
[]
[{"$nulls":10},"Summe",{"$f":"SUM(L38:N41)","v":0},null,null,{"$f":"IF(E38+I38>4,0,(IF(J38+F38<5,0,(IF(L43-I40<(IF(L43<(SUM(O38:Q41)),L43,(SUM(O38:Q41)))),L43-I40, (IF(L43<(SUM(O38:Q41)),L43,(SUM(O38:Q41)))))))))","v":0},{"$nulls":3},"Summe",{"$f":"SUM(T38:V42)","v":0},null,null,{"$f":"O11+O19+O27+O35+O43","v":0}]
["*TN: Teilnehmer/-innen\nDie Beschreibung der Maßnahmen kann auch formlos auf einem extra Blatt erfolgen. Teilnahmelisten sind beizufügen!",{"$nulls":9},{"$f":"IF(E38+I38>4,\"Die Maßnahme ist nicht zuwendungsfähig, da sie die Höchstdauer von 4 Tagen überschreitet.\",\"\")","v":""}]
[{"$nulls":10},{"$f":"IF(F38+J38<5,\"Die Maßnahme ist nicht zuwendungsfähig, da die Mindestteilnehmerzahl von 5 jungen Menschen nicht erbracht wird.\",\"\")","v":"Die Maßnahme ist nicht zuwendungsfähig, da die Mindestteilnehmerzahl von 5 jungen Menschen nicht erbracht wird."}]

{"sheet":"Personalausgaben","index":19,"n_rows":18,"n_cols":12,"rows_kept":18,"merged":[[3,3,3,4],[3,11,5,12],[4,3,4,4],[5,3,5,4],[6,3,6,4],[7,3,7,4],[8,3,8,4],[9,3,9,4],[10,3,10,4],[11,3,11,4],[12,3,12,4],[13,3,13,4],[14,3,14,4],[15,0,15,5],[16,0,16,2],[16,3,16,4]]}
["Landeshauptstadt Dresden - Jugendamt",null,null,{"$f":"Deckblatt!R1","v":"Verwendungsnachweis 2019/2020"},{"$nulls":4},"AZ:",{"$f":"Deckblatt!K4","v":0}]
["Personalausgaben",null,{"$f":"Deckblatt!P18","v":0}]
["lfd. Nr.","Name, Vorname","Stellen-/ Tätigkeitsbezeichnung","Æ","h/W","in VK","Ausgaben\nin Euro","Ausgaben enthalten leistungsorientierte Bezahlung gemäß \n§ 18 TVöD i. H. v.","Ausgaben enthalten Zuschläge i. H. v.","Art der Zuschläge/Zulagen"]
[1,{"$nulls":4},{"$f":"D4/40","v":0},{"$nulls":5},"Zu jeder Fachkraft ist das Blatt \"Angaben zur Fachkraft\" vollständig auszufüllen und mit einzureichen (Folgeblatt). Das Blatt bietet eine Rechenhilfe bzgl. der wöchentlichen Arbeitszeit im Jahresdurchschnitt."]
[2,{"$nulls":4},{"$f":"D5/40","v":0}]
[3,{"$nulls":4},0]
[4,{"$nulls":4},0]
[5,{"$nulls":4},0]
[6,{"$nulls":4},0]
[7,{"$nulls":4},0]
[8,{"$nulls":4},0]
[9,{"$nulls":4},0]
[10,{"$nulls":4},0]
[11,{"$nulls":4},0]
[12,{"$nulls":4},0]
["Berufsgenossenschaft \n(i. d. R. des Vorjahres, Ausgabenanfall aber im Abrechnungszeitraum, jedoch nach dem 28.02.)"]
["Summe",null,null,{"$f":"SUM(D4:E15)","v":0},null,{"$f":"SUM(F4:F15)","v":0},{"$f":"SUM(G4:G16)","v":0},{"$f":"SUM(H4:H15)","v":0},{"$f":"SUM(I4:I15)","v":0}]
["Æ","h/W"]

{"sheet":"Angaben zur Fachkraft","index":20,"n_rows":58,"n_cols":22,"rows_kept":58,"merged":[[2,10,2,15],[2,18,9,23],[6,0,6,4],[6,6,6,8],[6,10,6,15],[8,15,38,15],[9,2,9,3],[9,4,9,6],[9,7,9,9],[12,0,13,8],[15,0,16,8],[18,0,19,8],[22,9,22,13],[23,2,23,3],[23,5,23,7],[23,9,23,14],[26,8,27,13],[27,4,28,5],[29,1,29,14],[30,0,30,10],[30,13,32,14],[34,0,34,2],[34,3,34,4],[34,5,34,6],[34,7,34,8],[34,9,34,10],[34,11,34,12],[34,13,34,14],[38,0,38,2],[38,3,38,5],[38,11,38,13],[41,8,41,9],[44,0,44,2],[44,3,44,4],[44,5,44,6],[44,8,44,10],[44,11,44,12],[44,13,44,14],[44,16,44,18],[44,19,44,20],[44,21,44,22],[46,0,46,2],[46,3,46,4],[46,5,46,6],[46,8,46,10],[46,11,46,12],[46,13,46,14],[46,16,46,18],[46,19,46,20],[46,21,46,22],[48,0,48,2],[48,3,48,4],[48,5,48,6],[48,8,48,10],[48,11,48,12],[48,13,48,14],[52,0,52,3],[52,4,52,6],[52,7,53,8],[52,9,53,10],[52,11,52,12],[52,13,53,14],[54,7,54,8],[54,9,54,10],[54,13,54,14],[55,0,55,3],[55,4,55,8],[55,9,57,11],[55,12,58,14],[56,0,56,3],[56,4,56,8],[57,4,57,8]]}
["Landeshauptstadt Dresden - Jugendamt",{"$nulls":14},"Förderung von Trägern der freien Jugendhilfe"]
[]
["Angaben zur geförderten Fachkraft",{"$nulls":8},"Zeitraum",{"$nulls":8},"Die Angaben zur Fachkraft sind für jede Person vollständig zu leisten und mit dem Verwendungsnachweis einzureichen. Das Blatt ist identisch mit dem der Antragstellung. Demnach kann auch das Blatt \"Angaben zur Fachkraft\" aus der Antragstellung weiter vverwendet werden (natürlich aktualisiert auf die aktuellen Gegebenheiten). Es ist daher sinnvoll, sich dieses Blatt je Fachkraft im PC anzulegen, um nicht immer alles neu ausfüllen zu müssen."]
["Zutreffendes ist anzukreuzen."]
[]
["Name, Vorname",{"$nulls":5},"Geburtsdatum",{"$nulls":3},"Stellen-/Tätigkeitsbezeichnung"]
[]
[]
["Stellenbeschreibung"]
["ist beigefügt",null,"oder",null,"Stellenbeschreibung liegt\ndem Amt vor mit Datum: ",{"$nulls":6},"Sie behält ihre Gültigkeit:"]
["Ausbildung"]
["Berufsabschluss:"]
[{"$nulls":9},"Kopie* des Abschlusses:"]
[{"$nulls":9},"ist beigefügt:",null,null,"liegt dem Amt vor:"]
["berufsbegleitende Ausbildung:"]
[{"$nulls":9},"Immatrikulationsbescheinigung:"]
[{"$nulls":9},"ist beigefügt:",null,null,"liegt dem Amt vor:"]
["Zusatzqualifikationen:"]
[{"$nulls":9},"Kopie*:"]
[{"$nulls":9},"ist beigefügt:",null,null,"liegt dem Amt vor:"]
["*Die kopierten Qualifikationsnachweise müssen mit dem Vermerk des Trägers \"Das Original hat am ... (Datum) vorgelegen\" versehen sein."]
["Vergütung"]
["in Anlehnung an den Tarif öffentlicher Dienst (TVöD bzw. TVÜ-VKA)",{"$nulls":8},"anderer Tarifvertrag (Bezeichnung)"]
["Entgeltgruppe:",{"$nulls":4},"übergeleitete(r)  Beschäftigte(r)"]
[]
["Sozialdaten (nur für \"übergeleitete Beschäftigte\")"]
["Familienstand:",null,"ledig",null,"verheiratet",null,"verwitwet",null,"Ehepartner im öffentlichen Dienst  bzw. nach dem Überleitungstarifvertrag des TVöD vergütet:"]
["Stichtag 30.09.2005",{"$nulls":3},"geschieden"]
[]
["Kinder: ","(Angaben sind für alle übergeleitete Beschäftigte zu leisten; es sind nur die Kinder zu berücksichtigen, die bis zum 31.12.2005 geboren wurden)"]
["1. Anzahl der Kinder, für welche der/die Beschäftigte im Antragszeitraum Kindergeld erhält:"]
["                       "]
[]
[]
["Geb.daten der zu berücksichtigenden Kinder:"]
[{"$nulls":3},"1. Kind",null,"2. Kind",null,"3. Kind",null,"4. Kind",null,"5. Kind",null,"6. Kind"]
["Beschäftigungszeit"]
[]
["in der o. g. Tätigkeit beschäftigt seit: ",{"$nulls":5},"Aufnahme der Tätigkeit im Angebot am:"]
[]
["Arbeitsumfang ",{"$nulls":7},"Jahresdurchschnitt:",{"$nulls":3},"in VK:"]
["Regelmäßige wöchentliche Arbeitszeit:",{"$nulls":7},{"$f":"ROUND((F45/12*D45)+(N45/12*L45)+(F47/12*D47)+(N47/12*L47)+(F49/12*D49)+(N49/12*L49),2)","v":0},null,"h/Woche",null,{"$f":"ROUND(I42/40,2)","v":0},{"$nulls":3},"Bsp.:"]
[]
["Datum (von - bis)",null,null," in Monaten",null,"Std./Woche",null,null,"Datum (von - bis)",null,null," in Monaten",null,"Std./Woche",null,null,"Datum (von - bis)",null,null," in Monaten",null,"Std./Woche"]
[{"$nulls":16},"01.01. - 31.03.",null,null,{"v":3,"d":"3.00"},null,"20"]
["Datum (von - bis)",null,null," in Monaten",null,"Std./Woche",null,null,"Datum (von - bis)",null,null," in Monaten",null,"Std./Woche",null,null,"Datum (von - bis)",null,null," in Monaten",null,"Std./Woche"]
[{"$nulls":16},"01.04. - 15.10.",null,null,{"v":6.5,"d":"6.50"},null,"40"]
["Datum (von - bis)",null,null," in Monaten",null,"Std./Woche",null,null,"Datum (von - bis)",null,null," in Monaten",null,"Std./Woche"]
[{"$nulls":16},{"$f":"IF((D45+L45+D47+L47+D49+L49)>12,\"zu viele Monate!\",\"\")","v":""}]
[]
["Lohnnebenkosten etc.",{"$nulls":3},"geringfügig beschäftigt (Minijob)"]
[]
["AG-Anteile SV in %",{"$nulls":3},"Umlage-Verfahren der Krankenkassen in %",null,null,"AG-Prozentsatz gesamt",null,"AG-Anteile ges.               in EUR",null,"VWL in EUR",null,"bAV/Jahr                 in EUR"]
["PV","RV","AV","KV","U1","U2","IU",{"$nulls":4},"im Monat","im Jahr"]
[{"$nulls":7},{"$f":"SUM(A55:G55)","v":0}]
["PV: Pflegeversicherung                                RV: Rentenversicherung",{"$nulls":3},"U1: Lohnfortzahl.verfahren der Krankenkassen im Krankheitsfall",{"$nulls":4},"VWL: Vermögenswirksame Leistungen für 1,0 VK > max. 6,65 € pro Monat",null,null,"bAV: die Arbeitgeberaufwendungen für eine betriebl. Altersvorsorge sind max. in Höhe der städtischen Altersvorsorge (ZVK) zuwendungsfähig. "]
["AV: Arbeitslosenversicherung                         KV: Krankenversicherung",{"$nulls":3},"U2: Lohnfortzahlungsverfahren der Krankenkassen bei Mutterschaft"]
[{"$nulls":4},"IU: Insolvenzgeldumlage an die KK (ausgenommen Körperschaften des öff. Rechts)"]

{"sheet":"Ausgaben_ Finanzierung_ges","index":21,"n_rows":33,"n_cols":18,"rows_kept":33,"merged":[[2,13,2,14],[5,0,6,3],[5,4,5,7],[5,8,5,11],[5,12,5,15],[6,4,6,7],[6,8,6,11],[6,12,6,15],[6,17,6,20],[8,0,8,3],[8,4,8,7],[8,8,8,11],[8,12,8,15],[9,0,10,0],[9,1,9,3],[9,4,9,7],[9,8,9,11],[9,12,9,15],[10,1,10,3],[10,4,10,7],[10,8,10,11],[10,12,10,15],[11,0,11,3],[11,4,11,7],[11,8,11,11],[11,12,11,15],[12,0,12,3],[12,4,12,7],[12,8,12,11],[12,12,12,15],[13,0,13,3],[13,4,13,7],[13,8,13,11],[13,12,13,15],[14,0,14,3],[14,4,14,7],[14,8,14,11],[14,12,14,15],[16,0,17,3],[16,4,16,7],[16,8,16,11],[16,12,16,15],[17,4,17,7],[17,8,17,11],[17,12,17,15],[19,0,20,3],[19,4,19,7],[19,8,19,11],[19,12,19,15],[20,4,20,7],[20,8,20,11],[20,12,20,15],[23,0,23,11],[23,12,23,15],[24,0,24,11],[24,12,24,15],[25,0,25,11],[25,12,25,15],[26,0,26,11],[26,12,26,15],[27,0,27,11],[27,12,27,15],[28,0,28,11],[28,12,28,15],[29,0,29,11],[29,12,29,15],[32,0,35,15],[32,17,35,18]]}
["Landeshauptstadt Dresden - Jugendamt",{"$nulls":7},{"$f":"Deckblatt!R1","v":"Verwendungsnachweis 2019/2020"},{"$nulls":3},"AZ:",null,null,{"$f":"Deckblatt!K4","v":0}]
[]
[{"$nulls":12},"Ausgaben- und Finanzierungsnachweis",{"$f":"Deckblatt!P18","v":0}]
[]
[]
["Ausgaben",{"$nulls":3},"Personalausgaben",{"$nulls":3},"Sachausgaben",{"$nulls":3},"Gesamtausgaben"]
[{"$nulls":4},{"$f":"Personalausgaben!G17","v":0},{"$nulls":3},{"$f":"Sachausgaben!N38","v":0},{"$nulls":3},{"$f":"SUM(E7:L7)","v":0},{"$nulls":4}," Wertübernahme aus den Blättern \"Personalausgaben\" und \"Sachausgaben\""]
[]
["Finanzierung",{"$nulls":3},"Personalausgaben",{"$nulls":3},"Sachausgaben",{"$nulls":3},"gesamt"]
["Jugendamt Dresden","Projektförderung",{"$nulls":10},{"$f":"SUM(E10:L10)","v":0}]
[null,"personenbezogene Förderung bei Bedürftigkeit des/der Einzelnen (BM, EPM)",{"$nulls":10},{"$f":"I11","v":0}]
["weitere öffentliche Mittel",{"$nulls":11},{"$f":"SUM(E12:L12)","v":0}]
["sonstige Finanzierungsquellen",{"$nulls":11},{"$f":"SUM(E13:L13)","v":0}]
["Eigenmittel (z. B. Spenden, Teilnahmebeiträge, Einnahmen aus Vermietung)",{"$nulls":11},{"$f":"SUM(E14:L14)","v":0}]
["gesamt",{"$nulls":3},{"$f":"SUM(E10:G14)","v":0},{"$nulls":3},{"$f":"SUM(I10:K14)","v":0},{"$nulls":3},{"$f":"SUM(E15:L15)","v":0},{"$nulls":4},{"$f":"IF(M15<>M7,\"Fehler: Ausgaben ungleich Finanzierung!\",\"\")","v":""}]
[]
["Eigenleistungen",{"$nulls":3},"Anzahl der Stunden",{"$nulls":3},{"v":9.19,"d":"9.19 €"},{"$nulls":3},"in EUR"]
[{"$nulls":8},"je Stunde",{"$nulls":3},{"$f":"E18*I17","v":0}]
[]
["Eigenanteil",{"$nulls":3},"Eigenmittel in %",{"$nulls":3},"Eigenleistungen in %",{"$nulls":3}," = Eigenanteil in %"]
[{"$nulls":4},{"$f":"ROUND(M14*100/M7,1)","v":{"$error":"#DIV/0!"}},{"$nulls":3},{"$f":"ROUND(M18*100/(M7+M18),1)","v":{"$error":"#DIV/0!"}},{"$nulls":3},{"$f":"ROUND((M18+M14)*100/(M7+M18),1)","v":{"$error":"#DIV/0!"}}]
[]
["Differenzierte Darstellung der ggf. weiteren öffentlichen Mittel und sonstigen Finanzierungsquellen"]
["Zuwendungsgeber/Einnahmequelle",{"$nulls":11},"Betrag in EUR"]
{"$rows_empty":7}
["Bemerkungen"]
[{"$nulls":17},"Sie möchten Absätze im Eingabefeld einfügen? \n-> Alt+Enter"]